{"text_format":"1","workbook":"xlsx","n_sheets":22,"sheets":["Instructions","CW Grant Sheet","Graphs","Data","SummaryComparison","Do Not Delete","Teacher1Pretest","Teacher2Pretest","Teacher3Pretest","Teacher4Pretest","Do Not Use","Teacher5Pretest","Teacher6Pretest","SummaryPretest","SG statement","Teacher1Post","Teacher2Post","Teacher3Post","Teacher4Post","Teacher5Post","Teacher6Post","SummaryPost"],"not_rendered":{"charts":4,"images":0,"macros":1,"external_links":0,"defined_names":2,"comments":0,"pivot_tables":1},"unopened":[],"bounds":{"document_bytes":16777216,"sheet_cells":100000,"rows_first":2000,"rows_last":500,"rows_between":2000,"halvings":0,"cell_chars":16384,"cell_head_chars":4096},"cells_cut":0,"cells_raw":0,"read":"whole","date_system":"1900"}

{"sheet":"Instructions","index":0,"n_rows":21,"n_cols":3,"rows_kept":21,"cut":false,"hidden":false,"merged":[[2,0,2,6],[0,0,0,18]]}
["INSTRUCTIONS"]
[]
["1.  The following information must be entered from the \"Data\" page:"]
[null,null,"Teacher Name"]
[null,null,"Student Name"]
[null,null,"CFA points possible"]
[null,null,"Level scores (should be entered as the minimum score possible for given level)"]
[null,null,"Testing dates"]
[null,null,"SWD designation"]
[null,null,"Assessment Name"]
[null,null,"Grade Level"]
[null,"All other tabs in the workbook will automatically populate from the information entered on the Data page."]
[]
["2.  To designate a student as a SWD, type a double asterisk before their name (see examples).  This will automatically highlight their name and allow the Grant Sheet to track them."]
["3.  All sheets are protected so formulas are not damaged.  Please do not unprotect them!"]
["4.  If a student moves, DO NOT delete their cell.  Deletion of cells will cause the formulas to retrieve an error.  Leave the cell blank instead."]
["5.  If your team has fewer than 6 teachers, you can \"hide\" unnecessary tabs and cells.  To hide a tab, right click on the tab and select \"hide\".  "]
["6.  To protect and unprotect a sheet, go to the \"review\" tab at the top excel toolbar."]
["7.  Within the Graph tab, you can compare pretest and post-test data.  On the large graph, you may manipulate the data it shows to isolate certain teachers or just pretest/post-test data. "]
["      To do this, click on one of the gray buttons at the bottom, left-hand side of the graph.  You can then click on the information you want the graph to display.  All data is automatically pulled from other tabs."]
["      When changes are made to the data, the graph must be refreshed.  To do this, click the \"refresh\" button below the table.  "]

{"sheet":"CW Grant Sheet","index":1,"n_rows":22,"n_cols":14,"rows_kept":22,"cut":false,"hidden":false,"merged":[[21,2,21,3],[21,4,21,5],[21,8,21,9],[21,10,21,13],[22,0,22,13],[10,1,10,5],[10,7,10,13],[11,1,11,5],[11,7,11,13],[13,2,13,4],[13,8,13,10],[13,12,13,13],[7,0,7,5],[7,6,7,13],[8,1,8,5],[8,7,8,13],[9,1,9,5],[9,7,9,13],[4,1,4,4],[4,5,4,6],[4,7,4,13],[5,1,5,7],[5,8,5,10],[5,11,5,13],[0,0,0,13],[1,1,1,5],[1,7,1,13],[2,1,2,5],[2,7,2,13],[3,2,3,3],[3,5,3,6],[3,7,3,9],[3,10,3,11],[3,12,3,13]]}
["1st CFA – Reteaching CFA (GRADE-LEVEL SUMMARY)"]
["RPDC","8-St. Louis",null,null,null,null,"Consultant","Julie Sperry"]
["District Name","Fort Zumwalt-RII",null,null,null,null,"Building Name","Forest Park Elementary"]
["Grade-level",{"$f":"Data!N6","v":"Grade 4"},"Total Grade Size",null,149,"#SWD in Grade",null,26,null,null,"# Teachers in Grade",null,6]
["Content Area",null,null,null,null,"Instructional Practices"]
["Core Standard Addressed",{"$f":"Data!N9","v":"Main Idea- R.I.4.2"},null,null,null,null,null,null,"Date Submitted to RPDC",null,null,"2014-05-28"]
[]
["1st Strategies Used",null,null,null,null,null,"2nd Strategies Used"]
["Proficient and Higher","  ",null,null,null,null,"Proficient and Higher"]
["Close to Proficiency"," ",null,null,null,null,"Close to Proficiency"]
["Far to Go (likely to become proficient)",null,null,null,null,null,"Far to Go (likely to become proficient)"]
["Intervention Students (not likely to become proficient)",null,null,null,null,null,"Intervention Students (not likely to become proficient)"]
[]
["Total Possible Score for 1st CFA",{"$f":"Data!N10","v":6},"1st CFA Date(s) Administered",null,null,{"$f":"Data!N8","v":"2/26/14"},"Total Possible Score for Reteaching CFA",{"$f":"Teacher1Post!P7","v":6},"Reteaching CFA Date(s) Administered",null,null,{"$f":"Data!O8","v":"3/20/14"},"% Change from 1st CFA to Reteaching"]
["Groups","Total Possible Score for Levels","# All Students","# SWD","% All Students","% SWD","Groups","Total Possible Score for Levels","# All Students","# SWD","% All Students","% SWD","%All Students","% SWD"]
["Proficient and Higher",{"$f":"Data!N11","v":5},{"$f":"SummaryPretest!D10","v":27},{"$f":"COUNTIF(Teacher1Pretest!$A$8:$A$38,'CW Grant Sheet'!B16)+COUNTIF(Teacher2Pretest!$A$8:$A$38,'CW Grant Sheet'!B16)+COUNTIF(Teacher3Pretest!$A$8:$A$38,'CW Grant Sheet'!B16)+COUNTIF(Teacher4Pretest!$A$8:$A$38,'CW Grant Sheet'!B16)+COUNTIF(Teacher5Pretest!$A$8:$A$38,'CW Grant Sheet'!B16)+COUNTIF(Teacher6Pretest!$A$8:$A$38,'CW Grant Sheet'!B16)","v":5},{"$f":"IFERROR(C16/$C$20,0)","v":0.28421052631578947},{"$f":"IFERROR(D16/$D$20,0)","v":0.25},"Proficient and Higher",{"$f":"Teacher1Post!P8","v":5},{"$f":"SummaryPost!D10","v":55},{"$f":"COUNTIF(Teacher1Post!$A$8:$A$38,'CW Grant Sheet'!H16)+COUNTIF(Teacher2Post!$A$8:$A$38,'CW Grant Sheet'!H16)+COUNTIF(Teacher3Post!$A$8:$A$38,'CW Grant Sheet'!H16)+COUNTIF(Teacher4Post!$A$8:$A$38,'CW Grant Sheet'!H16)+COUNTIF(Teacher5Post!$A$8:$A$38,'CW Grant Sheet'!H16)+COUNTIF(Teacher6Post!$A$8:$A$38,'CW Grant Sheet'!H16)","v":11},{"$f":"IFERROR(I16/$I$20,0)","v":0.57894736842105265},{"$f":"IFERROR(J16/$J$20,0)","v":0.55000000000000004},{"$f":"K16-E16","v":0.29473684210526319},0.30000000000000004]
["Close to Proficiency",{"$f":"Data!N12","v":4},{"$f":"SummaryPretest!H10","v":17},{"$f":"COUNTIF(Teacher1Pretest!$A$8:$A$38,'CW Grant Sheet'!B17)+COUNTIF(Teacher2Pretest!$A$8:$A$38,'CW Grant Sheet'!B17)+COUNTIF(Teacher3Pretest!$A$8:$A$38,'CW Grant Sheet'!B17)+COUNTIF(Teacher4Pretest!$A$8:$A$38,'CW Grant Sheet'!B17)+COUNTIF(Teacher5Pretest!$A$8:$A$38,'CW Grant Sheet'!B17)+COUNTIF(Teacher6Pretest!$A$8:$A$38,'CW Grant Sheet'!B17)","v":4},{"$f":"IFERROR(C17/$C$20,0)","v":0.17894736842105263},{"$f":"IFERROR(D17/$D$20,0)","v":0.2},"Close to Proficiency",{"$f":"Teacher1Post!P9","v":4},{"$f":"SummaryPost!H10","v":20},{"$f":"COUNTIF(Teacher1Post!$A$8:$A$38,'CW Grant Sheet'!H17)+COUNTIF(Teacher2Post!$A$8:$A$38,'CW Grant Sheet'!H17)+COUNTIF(Teacher3Post!$A$8:$A$38,'CW Grant Sheet'!H17)+COUNTIF(Teacher4Post!$A$8:$A$38,'CW Grant Sheet'!H17)+COUNTIF(Teacher5Post!$A$8:$A$38,'CW Grant Sheet'!H17)+COUNTIF(Teacher6Post!$A$8:$A$38,'CW Grant Sheet'!H17)","v":5},{"$f":"IFERROR(I17/$I$20,0)","v":0.21052631578947367},{"$f":"IFERROR(J17/$J$20,0)","v":0.25},3.157894736842104E-2,4.9999999999999989E-2]
["Far to Go (likely to become proficient)",{"$f":"Data!N13","v":3},{"$f":"SummaryPretest!L10","v":17},{"$f":"COUNTIF(Teacher1Pretest!$A$8:$A$38,'CW Grant Sheet'!B18)+COUNTIF(Teacher2Pretest!$A$8:$A$38,'CW Grant Sheet'!B18)+COUNTIF(Teacher3Pretest!$A$8:$A$38,'CW Grant Sheet'!B18)+COUNTIF(Teacher4Pretest!$A$8:$A$38,'CW Grant Sheet'!B18)+COUNTIF(Teacher5Pretest!$A$8:$A$38,'CW Grant Sheet'!B18)+COUNTIF(Teacher6Pretest!$A$8:$A$38,'CW Grant Sheet'!B18)","v":4},{"$f":"IFERROR(C18/$C$20,0)","v":0.17894736842105263},{"$f":"IFERROR(D18/$D$20,0)","v":0.2},"Far to Go (likely to become proficient)",{"$f":"Teacher1Post!P10","v":3},{"$f":"SummaryPost!L10","v":10},{"$f":"COUNTIF(Teacher1Post!$A$8:$A$38,'CW Grant Sheet'!H18)+COUNTIF(Teacher2Post!$A$8:$A$38,'CW Grant Sheet'!H18)+COUNTIF(Teacher3Post!$A$8:$A$38,'CW Grant Sheet'!H18)+COUNTIF(Teacher4Post!$A$8:$A$38,'CW Grant Sheet'!H18)+COUNTIF(Teacher5Post!$A$8:$A$38,'CW Grant Sheet'!H18)+COUNTIF(Teacher6Post!$A$8:$A$38,'CW Grant Sheet'!H18)","v":2},{"$f":"IFERROR(I18/$I$20,0)","v":0.10526315789473684},{"$f":"IFERROR(J18/$J$20,0)","v":0.1},-7.3684210526315796E-2,-0.1]
["Intervention Students (not likely to become proficient)",{"$f":"Data!N14","v":1},{"$f":"SummaryPretest!P10","v":34},{"$f":"COUNTIF(Teacher1Pretest!$A$8:$A$38,'CW Grant Sheet'!B19)+COUNTIF(Teacher2Pretest!$A$8:$A$38,'CW Grant Sheet'!B19)+COUNTIF(Teacher3Pretest!$A$8:$A$38,'CW Grant Sheet'!B19)+COUNTIF(Teacher4Pretest!$A$8:$A$38,'CW Grant Sheet'!B19)+COUNTIF(Teacher5Pretest!$A$8:$A$38,'CW Grant Sheet'!B19)+COUNTIF(Teacher6Pretest!$A$8:$A$38,'CW Grant Sheet'!B19)","v":7},{"$f":"IFERROR(C19/$C$20,0)","v":0.35789473684210527},{"$f":"IFERROR(D19/$D$20,0)","v":0.35},"Intervention Students (not likely to become proficient)",{"$f":"Teacher1Post!P11","v":1},{"$f":"SummaryPost!P10","v":10},{"$f":"COUNTIF(Teacher1Post!$A$8:$A$38,'CW Grant Sheet'!H19)+COUNTIF(Teacher2Post!$A$8:$A$38,'CW Grant Sheet'!H19)+COUNTIF(Teacher3Post!$A$8:$A$38,'CW Grant Sheet'!H19)+COUNTIF(Teacher4Post!$A$8:$A$38,'CW Grant Sheet'!H19)+COUNTIF(Teacher5Post!$A$8:$A$38,'CW Grant Sheet'!H19)+COUNTIF(Teacher6Post!$A$8:$A$38,'CW Grant Sheet'!H19)","v":2},{"$f":"IFERROR(I19/$I$20,0)","v":0.10526315789473684},{"$f":"IFERROR(J19/$J$20,0)","v":0.1},-0.25263157894736843,-0.24999999999999997]
["TOTALS",null,{"$f":"SUM(C16:C19)","v":95},{"$f":"SUM(D16:D19)","v":20},null,null,null,null,{"$f":"SUM(I16:I19)","v":95},{"$f":"SUM(J16:J19)","v":20}]
[]
["# SWD Not Taking CFA",null,"Reason(s) not taking CFA",null,null,null,"# SWD Not Taking CFA",null,"Reason(s) not taking CFA"]

{"sheet":"Graphs","index":2,"n_rows":17,"n_cols":5,"rows_kept":17,"cut":false,"hidden":false,"merged":[]}
["Row Labels"," Proficient and Higher"," Close to Proficiency","Far to Go But Likely to Become Proficient ","Intervention "]
["March",17,6,7,8]
["Pre Test",6,2,5,6]
["Post Test",11,4,2,2]
["Jones",18,6,8,10]
["Pre Test",7,3,3,8]
["Post Test",11,3,5,2]
["Gibson",17,9,4,10]
["Pre Test",5,5,2,8]
["Post Test",12,4,2,2]
["Smith",17,9,2,10]
["Pre Test",7,3,2,7]
["Post Test",10,6,0,3]
["Milburn",13,7,6,6]
["Pre Test",2,4,5,5]
["Post Test",11,3,1,1]
["Grand Total",82,37,27,44]

{"sheet":"Data","index":3,"n_rows":31,"n_cols":15,"rows_kept":31,"cut":false,"hidden":false,"merged":[[8,13,8,14],[5,13,5,14],[4,13,4,14]]}
["March","Jones","Gibson","Smith","Do Not Use","Milburn","Teacher6",null,null,null,"Groups","Toggle"]
["Judy Blome","**Justin Bieber","**Albert Einstein","Michael Jordan","Do Not Use","Dave Sanders","Student1",null,null,null,null,"YES"]
["Lewis Carroll","Taylor Swift","Alfred Nobel","Muhammad Ali","Do Not Use","Carolyn Neal","Student2",null,null,null,"Kindergarten","NO"]
["Betsy Byars","Beyonce Knowles","Benjamin Franklin","Roger Federer","Do Not Use","Bertha Richardson","Student3",null,null,null,"Grade 1"]
["Pam Conrad","Madonna","Carl Sagan*","**Michael Phelps","Do Not Use","Bill Scheffler","Student4",null,null,null,"Grade 2",null,"School ","Forest Park"]
["Jean Fritz","Justin Timberlake","Charles Darwin","Wayne Gretzky","Do Not Use","Chris Montgomery","Student5",null,null,null,"Grade 3",null,"Student group:","Grade 4"]
["C.S. Lewis","Bon Jovi","Henry Ford","**Jim Thorpe","Do Not Use","Darlene Jones","Student6",null,null,null,"Grade 4",null,{"$f":"IF(N6=\"Other\",\"Please enter student group:\",\"\")","v":""},"Pretest","Post-test"]
["Lois Lowry","Tim McGraw","**Isaac Newton","Tiger Woods","Do Not Use","Don Rugraff","Student7",null,null,null,"Grade 5",null,"Meeting date:","2/26/14","3/20/14"]
["Patricia MacLachlan","Elton John","Ivan Pavlov","Serena Williams","Do Not Use","Dexter Schraer","Student8",null,null,null,"Other",null,"Assessment name:","Main Idea- R.I.4.2"]
["**Barbara Park","**Kelly Clarkson","Jane Goodall","**Joe Montana","Do Not Use","Janice Putman","Student9",null,null,null,null,null,"Points possible:",6,6]
["**Gary Paulsen","Aretha Franklin","Jean Piaget","Jeff Gordon","Do Not Use","Julie Sperry","Student10",null,null,null,"Dardenne",null,"Proficient:",5,5]
["Jack Prelutsky","Lady Gaga","**Jonas Salk","Peyton Manning","Do Not Use","Jeanne Rothermel","Student11",null,null,null,"Emge",null,"Close to proficient:",4,4]
["Cynthia Rylant","Billy Joel","**Marie Curie","Shaun White","Do Not Use","Rose Coleman","Student12",null,null,null,"Forest Park",null,"Far to go:",3,3]
["Louis Sachar","Bruno Mars","Sigmund Freud","Danica Patrick","Do Not Use","Randy Speer","Student13",null,null,null,"Hawthorn",null,"Intervention:",1,1]
["Shel Silverstein","Dolly Parton","Stephen Hawking","**Tony Hawk","Do Not Use","**Sam McCauley","Student14",null,null,null,"J.L. Mudd",null,"Configure SMART goal:","YES"]
["Seymour Simon","**Axl Rose","Thomas Edison","LeBron James","Do Not Use","Tricia Buchanan","Student15",null,null,null,"Lewis & Clark"]
["**Jerry Spinelli","Tony Bennett","John Dewey","Gordie Howe","Do Not Use","**Beth Tobin","Student16",null,null,null,"Mid Rivers"]
["R.L. Stine","Pat Benatar","**B.F. Skinner","**George Forman","Do Not Use","Student17","Student17",null,null,null,"Mt. Hope"]
["Jane Yolen","**Bob Dylan","Howard Gardner","Martina Navratilova","Do Not Use","Student18","Student18",null,null,null,"Ostmann"]
["J.K. Rowling","Eric Clapton","Lev Vygotsky","Yadier Molina","Do Not Use","Student19","Student19",null,null,null,"Pheasant Point"]
["Student20","Paul McCartney","Maria Montessori","Student20","Do Not Use","Student20","Student20",null,null,null,"Progress South"]
["Student21","**Mick Jagger","Student21","Student21","Do Not Use","Student21","Student21",null,null,null,"RockCreek"]
["Student22","Student22","Student22","Student22","Do Not Use","Student22","Student22",null,null,null,"St. Peters"]
["Student23","Student23","Student23","Student23","Do Not Use","Student23","Student23",null,null,null,"Twin Chimneys"]
["Student24","Student24","Student24","Student24","Do Not Use","Student24","Student24",null,null,null,"Westhoff"]
["Student25","Student25","Student25","Student25","Do Not Use","Student25","Student25"]
["Student26","Student26","Student26","Student26","Do Not Use","Student26","Student26"]
["Student27","Student27","Student27","Student27","Do Not Use","Student27","Student27"]
["Student28","Student28","Student28","Student28","Do Not Use","Student28","Student28"]
["Student29","Student29","Student29","Student29","Do Not Use","Student29","Student29"]
["Student30","Student30","Student30","Student30","Do Not Use","Student30","Student30"]

{"sheet":"SummaryComparison","index":4,"n_rows":13,"n_cols":19,"rows_kept":13,"cut":false,"hidden":false,"merged":[]}
[null,"Teacher","# Students",null,"# Proficient and Higher","% Proficient and Higher","Proficient Students",null,"# Close to Proficiency","% Close to Proficiency","Students Close to Proficiency",null,"# Far to Go ","% Far to Go ","Students Far to Go But Likely to Become Proficient",null,"# Intervention","% Intervention ","Intervention Students "]
["Pre Test",{"$f":"Data!A1","v":"March"},{"$f":"SummaryPretest!B2","v":19},null,{"$f":"SummaryPretest!D2","v":6},{"$f":"E2/C2","v":0.31578947368421051},{"$f":"SummaryPretest!F2","v":" Jean Fritz, Lois Lowry, Louis Sachar, Shel Silverstein, Seymour Simon, Jane Yolen"},null,{"$f":"SummaryPretest!H2","v":2},{"$f":"I2/C2","v":0.10526315789473684},{"$f":"SummaryPretest!J2","v":" Betsy Byars, **Jerry Spinelli"},null,{"$f":"SummaryPretest!L2","v":5},{"$f":"M2/C2","v":0.26315789473684209},{"$f":"SummaryPretest!N2","v":"Judy Blome, Patricia MacLachlan, **Barbara Park, Jack Prelutsky, R.L. Stine"},null,{"$f":"SummaryPretest!P2","v":6},{"$f":"Q2/C2","v":0.31578947368421051},{"$f":"SummaryPretest!R2","v":" Lewis Carroll, Pam Conrad, C.S. Lewis, **Gary Paulsen, Cynthia Rylant, J.K. Rowling"}]
["Post Test",{"$f":"Data!A1","v":"March"},{"$f":"SummaryPost!B2","v":19},null,{"$f":"SummaryPost!D2","v":11},{"$f":"E3/C3","v":0.57894736842105265},{"$f":"SummaryPost!F2","v":"Judy Blome, Betsy Byars, Jean Fritz, Patricia MacLachlan, **Barbara Park, Jack Prelutsky, Louis Sachar, Shel Silverstein, Seymour Simon, **Jerry Spinelli, Jane Yolen"},null,{"$f":"SummaryPost!H2","v":4},{"$f":"I3/C3","v":0.21052631578947367},{"$f":"SummaryPost!J2","v":" Pam Conrad, **Gary Paulsen, Cynthia Rylant, R.L. Stine"},null,{"$f":"SummaryPost!L2","v":2},{"$f":"M3/C3","v":0.10526315789473684},{"$f":"SummaryPost!N2","v":" Lewis Carroll, Lois Lowry"},null,{"$f":"SummaryPost!P2","v":2},{"$f":"Q3/C3","v":0.10526315789473684},{"$f":"SummaryPost!R2","v":" C.S. Lewis, J.K. Rowling"}]
["Pre Test",{"$f":"Data!B1","v":"Jones"},{"$f":"SummaryPretest!B3","v":21},null,{"$f":"SummaryPretest!D3","v":7},{"$f":"E4/C4","v":0.33333333333333331},{"$f":"SummaryPretest!F3","v":"**Justin Bieber, Taylor Swift, Beyonce Knowles, Tim McGraw, **Kelly Clarkson, Bruno Mars, **Bob Dylan"},null,{"$f":"SummaryPretest!H3","v":3},0.14285714285714285,{"$f":"SummaryPretest!J3","v":" Madonna, Billy Joel, **Mick Jagger"},null,{"$f":"SummaryPretest!L3","v":3},0.14285714285714285,{"$f":"SummaryPretest!N3","v":" Aretha Franklin, Dolly Parton, Eric Clapton"},null,{"$f":"SummaryPretest!P3","v":8},{"$f":"Q4/C4","v":0.38095238095238093},{"$f":"SummaryPretest!R3","v":" Justin Timberlake, Bon Jovi, Elton John, Lady Gaga, **Axl Rose, Tony Bennett, Pat Benatar, Paul McCartney"}]
["Post Test",{"$f":"Data!B1","v":"Jones"},{"$f":"SummaryPost!B3","v":21},null,{"$f":"SummaryPost!D3","v":11},0.52380952380952384,{"$f":"SummaryPost!F3","v":"**Justin Bieber, Taylor Swift, Beyonce Knowles, Madonna, **Kelly Clarkson, Aretha Franklin, Lady Gaga, Bruno Mars, Dolly Parton, Tony Bennett, Pat Benatar"},null,{"$f":"SummaryPost!H3","v":3},0.14285714285714285,{"$f":"SummaryPost!J3","v":" Billy Joel, **Axl Rose, Paul McCartney"},null,{"$f":"SummaryPost!L3","v":5},0.23809523809523808,{"$f":"SummaryPost!N3","v":" Bon Jovi, Tim McGraw, **Bob Dylan, Eric Clapton, **Mick Jagger"},null,{"$f":"SummaryPost!P3","v":2},9.5238095238095233E-2,{"$f":"SummaryPost!R3","v":" Justin Timberlake, Elton John"}]
["Pre Test",{"$f":"Data!C1","v":"Gibson"},{"$f":"SummaryPretest!B4","v":20},null,{"$f":"SummaryPretest!D4","v":5},0.25,{"$f":"SummaryPretest!F4","v":" Carl Sagan*, **Marie Curie, Sigmund Freud, Stephen Hawking, Howard Gardner"},null,{"$f":"SummaryPretest!H4","v":5},0.25,{"$f":"SummaryPretest!J4","v":"**Albert Einstein, Benjamin Franklin, John Dewey, **B.F. Skinner, Lev Vygotsky"},null,{"$f":"SummaryPretest!L4","v":2},0.1,{"$f":"SummaryPretest!N4","v":" Henry Ford, Maria Montessori"},null,{"$f":"SummaryPretest!P4","v":8},0.4,{"$f":"SummaryPretest!R4","v":" Alfred Nobel, Charles Darwin, **Isaac Newton, Ivan Pavlov, Jane Goodall, Jean Piaget, **Jonas Salk, Thomas Edison"}]
["Post Test",{"$f":"Data!C1","v":"Gibson"},{"$f":"SummaryPost!B4","v":20},null,{"$f":"SummaryPost!D4","v":12},0.6,{"$f":"SummaryPost!F4","v":"**Albert Einstein, Carl Sagan*, Henry Ford, Ivan Pavlov, **Jonas Salk, **Marie Curie, Sigmund Freud, Stephen Hawking, Thomas Edison, Howard Gardner, Lev Vygotsky, Maria Montessori"},null,{"$f":"SummaryPost!H4","v":4},0.2,{"$f":"SummaryPost!J4","v":" Alfred Nobel, Charles Darwin, John Dewey, **B.F. Skinner"},null,{"$f":"SummaryPost!L4","v":2},0.1,{"$f":"SummaryPost!N4","v":" Benjamin Franklin, Jane Goodall"},null,{"$f":"SummaryPost!P4","v":2},0.1,{"$f":"SummaryPost!R4","v":" **Isaac Newton, Jean Piaget"}]
["Pre Test",{"$f":"Data!D1","v":"Smith"},{"$f":"SummaryPretest!B5","v":19},null,{"$f":"SummaryPretest!D5","v":7},0.36842105263157893,{"$f":"SummaryPretest!F5","v":" **Michael Phelps, Shaun White, Danica Patrick, LeBron James, Gordie Howe, Martina Navratilova, Yadier Molina"},null,{"$f":"SummaryPretest!H5","v":3},0.15789473684210525,{"$f":"SummaryPretest!J5","v":"Michael Jordan, Muhammad Ali, Jeff Gordon"},null,{"$f":"SummaryPretest!L5","v":2},0.10526315789473684,{"$f":"SummaryPretest!N5","v":" **Tony Hawk, **George Forman"},null,{"$f":"SummaryPretest!P5","v":7},0.36842105263157893,{"$f":"SummaryPretest!R5","v":" Roger Federer, Wayne Gretzky, **Jim Thorpe, Tiger Woods, Serena Williams, **Joe Montana, Peyton Manning"}]
["Post Test",{"$f":"Data!D1","v":"Smith"},{"$f":"SummaryPost!B5","v":19},null,{"$f":"SummaryPost!D5","v":10},0.52631578947368418,{"$f":"SummaryPost!F5","v":"Michael Jordan, Muhammad Ali, Serena Williams, **Joe Montana, Shaun White, Danica Patrick, **Tony Hawk, LeBron James, **George Forman, Martina Navratilova"},null,{"$f":"SummaryPost!H5","v":6},0.31578947368421051,{"$f":"SummaryPost!J5","v":" Roger Federer, Wayne Gretzky, **Jim Thorpe, Jeff Gordon, Peyton Manning, Yadier Molina"},null,{"$f":"SummaryPost!L5","v":0},0,{"$f":"SummaryPost!N5","v":""},null,{"$f":"SummaryPost!P5","v":3},0.15789473684210525,{"$f":"SummaryPost!R5","v":" **Michael Phelps, Tiger Woods, Gordie Howe"}]
["Pre Test",{"$f":"Data!F1","v":"Milburn"},{"$f":"SummaryPretest!B7","v":16},null,{"$f":"SummaryPretest!D7","v":2},0.125,{"$f":"SummaryPretest!F7","v":" Chris Montgomery, Don Rugraff"},null,{"$f":"SummaryPretest!H7","v":4},0.25,{"$f":"SummaryPretest!J7","v":" Bertha Richardson, Bill Scheffler, Rose Coleman, Tricia Buchanan"},null,{"$f":"SummaryPretest!L7","v":5},0.3125,{"$f":"SummaryPretest!N7","v":"Dave Sanders, Carolyn Neal, Dexter Schraer, Julie Sperry, **Sam McCauley"},null,{"$f":"SummaryPretest!P7","v":5},0.3125,{"$f":"SummaryPretest!R7","v":" Darlene Jones, Janice Putman, Jeanne Rothermel, Randy Speer, **Beth Tobin"}]
["Post Test",{"$f":"Data!F1","v":"Milburn"},{"$f":"SummaryPost!B7","v":16},null,{"$f":"SummaryPost!D7","v":11},0.6875,{"$f":"SummaryPost!F7","v":"Dave Sanders, Carolyn Neal, Bertha Richardson, Chris Montgomery, Darlene Jones, Dexter Schraer, Janice Putman, Julie Sperry, Rose Coleman, **Sam McCauley, Tricia Buchanan"},null,{"$f":"SummaryPost!H7","v":3},0.1875,{"$f":"SummaryPost!J7","v":" Don Rugraff, Jeanne Rothermel, **Beth Tobin"},null,{"$f":"SummaryPost!L7","v":1},6.25E-2,{"$f":"SummaryPost!N7","v":" Randy Speer"},null,{"$f":"SummaryPost!P7","v":1},6.25E-2,{"$f":"SummaryPost!R7","v":" Bill Scheffler"}]
["Pre Test",{"$f":"Data!G1","v":"Teacher6"},{"$f":"SummaryPretest!B8","v":0},null,{"$f":"SummaryPretest!D8","v":0},{"$f":"E12/C12","v":{"$error":"#DIV/0!"}},{"$f":"SummaryPretest!F8","v":""},null,{"$f":"SummaryPretest!H8","v":0},{"$error":"#DIV/0!"},{"$f":"SummaryPretest!J8","v":""},null,{"$f":"SummaryPretest!L8","v":0},{"$error":"#DIV/0!"},{"$f":"SummaryPretest!N8","v":""},null,{"$f":"SummaryPretest!P8","v":0},{"$error":"#DIV/0!"},{"$f":"SummaryPretest!R8","v":""}]
["Post Test",{"$f":"Data!G1","v":"Teacher6"},{"$f":"SummaryPost!B8","v":0},null,{"$f":"SummaryPost!D8","v":0},{"$f":"E13/C13","v":{"$error":"#DIV/0!"}},{"$f":"SummaryPost!F8","v":""},null,{"$f":"SummaryPost!H8","v":0},{"$error":"#DIV/0!"},{"$f":"SummaryPost!J8","v":""},null,{"$f":"SummaryPost!L8","v":0},{"$error":"#DIV/0!"},{"$f":"SummaryPost!N8","v":""},null,{"$f":"SummaryPost!P8","v":0},{"$error":"#DIV/0!"},{"$f":"SummaryPost!R8","v":""}]

{"sheet":"Do Not Delete","index":5,"n_rows":13,"n_cols":6,"rows_kept":13,"cut":false,"hidden":true,"merged":[]}
["Teacher","Test","Proficient and Higher","Close to Proficiency","Far to Go But Likely to Become Proficient","Intervention (Far to Go and Not Likely to Become Proficient)"]
[{"$f":"Data!A1","v":"March"},"Pre Test",{"$f":"SummaryComparison!E2","v":6},{"$f":"SummaryComparison!I2","v":2},{"$f":"SummaryComparison!M2","v":5},{"$f":"SummaryComparison!Q2","v":6}]
[{"$f":"Data!A1","v":"March"},"Post Test",{"$f":"SummaryComparison!E3","v":11},{"$f":"SummaryComparison!I3","v":4},{"$f":"SummaryComparison!M3","v":2},{"$f":"SummaryComparison!Q3","v":2}]
[{"$f":"Data!B1","v":"Jones"},"Pre Test",{"$f":"SummaryComparison!E4","v":7},{"$f":"SummaryComparison!I4","v":3},{"$f":"SummaryComparison!M4","v":3},{"$f":"SummaryComparison!Q4","v":8}]
[{"$f":"Data!B1","v":"Jones"},"Post Test",{"$f":"SummaryComparison!E5","v":11},{"$f":"SummaryComparison!I5","v":3},{"$f":"SummaryComparison!M5","v":5},{"$f":"SummaryComparison!Q5","v":2}]
[{"$f":"Data!C1","v":"Gibson"},"Pre Test",{"$f":"SummaryComparison!E6","v":5},{"$f":"SummaryComparison!I6","v":5},{"$f":"SummaryComparison!M6","v":2},{"$f":"SummaryComparison!Q6","v":8}]
[{"$f":"Data!C1","v":"Gibson"},"Post Test",{"$f":"SummaryComparison!E7","v":12},{"$f":"SummaryComparison!I7","v":4},{"$f":"SummaryComparison!M7","v":2},{"$f":"SummaryComparison!Q7","v":2}]
[{"$f":"Data!D1","v":"Smith"},"Pre Test",{"$f":"SummaryComparison!E8","v":7},{"$f":"SummaryComparison!I8","v":3},{"$f":"SummaryComparison!M8","v":2},{"$f":"SummaryComparison!Q8","v":7}]
[{"$f":"Data!D1","v":"Smith"},"Post Test",{"$f":"SummaryComparison!E9","v":10},{"$f":"SummaryComparison!I9","v":6},{"$f":"SummaryComparison!M9","v":0},{"$f":"SummaryComparison!Q9","v":3}]
[{"$f":"Data!F1","v":"Milburn"},"Pre Test",{"$f":"SummaryComparison!E10","v":2},{"$f":"SummaryComparison!I10","v":4},{"$f":"SummaryComparison!M10","v":5},{"$f":"SummaryComparison!Q10","v":5}]
[{"$f":"Data!F1","v":"Milburn"},"Post Test",{"$f":"SummaryComparison!E11","v":11},{"$f":"SummaryComparison!I11","v":3},{"$f":"SummaryComparison!M11","v":1},{"$f":"SummaryComparison!Q11","v":1}]
[{"$f":"Data!G1","v":"Teacher6"},"Pre Test",{"$f":"SummaryComparison!E12","v":0},{"$f":"SummaryComparison!I12","v":0},{"$f":"SummaryComparison!M12","v":0},{"$f":"SummaryComparison!Q12","v":0}]
[{"$f":"Data!G1","v":"Teacher6"},"Post Test",{"$f":"SummaryComparison!E13","v":0},{"$f":"SummaryComparison!I13","v":0},{"$f":"SummaryComparison!M13","v":0},{"$f":"SummaryComparison!Q13","v":0}]

{"sheet":"Teacher1Pretest","index":6,"n_rows":39,"n_cols":16,"rows_kept":39,"cut":false,"hidden":false,"merged":[[0,3,0,4],[0,1,0,2],[4,1,6,1],[4,4,6,4],[4,3,5,3],[1,1,1,2],[1,3,1,4],[2,1,3,2],[2,3,3,4],[4,2,6,2]]}
[null,{"$f":"IF(Data!N6=\"Other\",Data!N7,Data!N6)","v":"Grade 4"},null,{"$f":"Data!A1","v":"March"}]
[null,"Meeting Date:",null,{"$f":"Data!N8","v":"2/26/14"}]
[null,"Assessment:",null,{"$f":"Data!N9","v":"Main Idea- R.I.4.2"}]
[]
[null,"Student Name","Points","Possible","Score - %"]
[]
[null,null,null,{"$f":"Data!N10","v":6},null,"Proficient",null,"Close",null,"Far",null,"Intervention"]
[{"$f":"IF(ISBLANK(C8),\"FALSE\",IF(LEFT(B8,2)=\"**\",IF(C8>=$O$8,$O$8,IF(C8>=$O$9,$O$9,IF(C8>=$O$10,$O$10,$O$11)))))","v":false},{"$f":"Data!A2","v":"Judy Blome"},3,{"$f":"IF(C8=\"\",\"\",$D$7)","v":6},{"$f":"IF(D8=\"\",\"\",C8/$D$7)","v":0.5},{"$f":"IF(C8>=O8,B8,\"\")","v":""},{"$f":"F8","v":""},{"$f":"IF(C8>=O9,IF(C8<O8,B8,\"\"),\"\")","v":""},{"$f":"H8","v":""},{"$f":"IF(C8>=O10,IF(C8<O9,B8,\"\"),\"\")","v":"Judy Blome"},{"$f":"J8","v":"Judy Blome"},{"$f":"IF(C8<O10,IF(C8=\"\",\"\",B8),\"\")","v":""},{"$f":"L8","v":""},null,{"$f":"Data!N11","v":5},"Proficient"]
[{"$f":"IF(ISBLANK(C9),\"FALSE\",IF(LEFT(B9,2)=\"**\",IF(C9>=$O$8,$O$8,IF(C9>=$O$9,$O$9,IF(C9>=$O$10,$O$10,$O$11)))))","v":false},{"$f":"Data!A3","v":"Lewis Carroll"},2,{"$f":"IF(C9=\"\",\"\",$D$7)","v":6},{"$f":"IF(D9=\"\",\"\",C9/$D$7)","v":0.33333333333333331},{"$f":"IF(C9>=O8,B9,\"\")","v":""},{"$f":"G8&IF(F9=\"\",\"\",\", \")&F9","v":""},{"$f":"IF(C9>=O9,IF(C9<O8,B9,\"\"),\"\")","v":""},{"$f":"I8&IF(H9=\"\",\"\",\", \")&H9","v":""},{"$f":"IF(C9>=O10,IF(C9<O9,B9,\"\"),\"\")","v":""},{"$f":"K8&IF(J9=\"\",\"\",\", \")&J9","v":"Judy Blome"},{"$f":"IF(C9<O10,IF(C9=\"\",\"\",B9),\"\")","v":"Lewis Carroll"},{"$f":"M8&IF(L9=\"\",\"\",\", \")&L9","v":", Lewis Carroll"},null,{"$f":"Data!N12","v":4},"Close to Proficient"]
[false,{"$f":"Data!A4","v":"Betsy Byars"},4,6,0.66666666666666663,{"$f":"IF(C10>=O8,B10,\"\")","v":""},{"$f":"G9&IF(F10=\"\",\"\",\", \")&F10","v":""},{"$f":"IF(C10>=O9,IF(C10<O8,B10,\"\"),\"\")","v":"Betsy Byars"},{"$f":"I9&IF(H10=\"\",\"\",\", \")&H10","v":", Betsy Byars"},{"$f":"IF(C10>=O10,IF(C10<O9,B10,\"\"),\"\")","v":""},{"$f":"K9&IF(J10=\"\",\"\",\", \")&J10","v":"Judy Blome"},{"$f":"IF(C10<O10,IF(C10=\"\",\"\",B10),\"\")","v":""},{"$f":"M9&IF(L10=\"\",\"\",\", \")&L10","v":", Lewis Carroll"},null,{"$f":"Data!N13","v":3},"Far to Go But Likely to Become Proficient"]
[false,{"$f":"Data!A5","v":"Pam Conrad"},2,6,0.33333333333333331,{"$f":"IF(C11>=O8,B11,\"\")","v":""},"",{"$f":"IF(C11>=O9,IF(C11<O8,B11,\"\"),\"\")","v":""},", Betsy Byars",{"$f":"IF(C11>=O10,IF(C11<O9,B11,\"\"),\"\")","v":""},"Judy Blome",{"$f":"IF(C11<O10,IF(C11=\"\",\"\",B11),\"\")","v":"Pam Conrad"},", Lewis Carroll, Pam Conrad",null,{"$f":"Data!N14","v":1},"Intervention (Far to Go But Not Likely to Become Proficient)"]
[false,{"$f":"Data!A6","v":"Jean Fritz"},6,6,1,{"$f":"IF(C12>=O8,B12,\"\")","v":"Jean Fritz"},", Jean Fritz",{"$f":"IF(C12>=O9,IF(C12<O8,B12,\"\"),\"\")","v":""},", Betsy Byars",{"$f":"IF(C12>=O10,IF(C12<O9,B12,\"\"),\"\")","v":""},"Judy Blome",{"$f":"IF(C12<O10,IF(C12=\"\",\"\",B12),\"\")","v":""},", Lewis Carroll, Pam Conrad"]
[false,{"$f":"Data!A7","v":"C.S. Lewis"},2,6,0.33333333333333331,{"$f":"IF(C13>=O8,B13,\"\")","v":""},", Jean Fritz",{"$f":"IF(C13>=O9,IF(C13<O8,B13,\"\"),\"\")","v":""},", Betsy Byars",{"$f":"IF(C13>=O10,IF(C13<O9,B13,\"\"),\"\")","v":""},"Judy Blome",{"$f":"IF(C13<O10,IF(C13=\"\",\"\",B13),\"\")","v":"C.S. Lewis"},", Lewis Carroll, Pam Conrad, C.S. Lewis"]
[false,{"$f":"Data!A8","v":"Lois Lowry"},6,6,1,{"$f":"IF(C14>=O8,B14,\"\")","v":"Lois Lowry"},", Jean Fritz, Lois Lowry",{"$f":"IF(C14>=O9,IF(C14<O8,B14,\"\"),\"\")","v":""},", Betsy Byars",{"$f":"IF(C14>=O10,IF(C14<O9,B14,\"\"),\"\")","v":""},"Judy Blome",{"$f":"IF(C14<O10,IF(C14=\"\",\"\",B14),\"\")","v":""},", Lewis Carroll, Pam Conrad, C.S. Lewis"]
[false,{"$f":"Data!A9","v":"Patricia MacLachlan"},3,6,0.5,{"$f":"IF(C15>=O8,B15,\"\")","v":""},", Jean Fritz, Lois Lowry",{"$f":"IF(C15>=O9,IF(C15<O8,B15,\"\"),\"\")","v":""},", Betsy Byars",{"$f":"IF(C15>=O10,IF(C15<O9,B15,\"\"),\"\")","v":"Patricia MacLachlan"},"Judy Blome, Patricia MacLachlan",{"$f":"IF(C15<O10,IF(C15=\"\",\"\",B15),\"\")","v":""},", Lewis Carroll, Pam Conrad, C.S. Lewis"]
[3,{"$f":"Data!A10","v":"**Barbara Park"},3,6,0.5,{"$f":"IF(C16>=O8,B16,\"\")","v":""},", Jean Fritz, Lois Lowry",{"$f":"IF(C16>=O9,IF(C16<O8,B16,\"\"),\"\")","v":""},", Betsy Byars",{"$f":"IF(C16>=O10,IF(C16<O9,B16,\"\"),\"\")","v":"**Barbara Park"},"Judy Blome, Patricia MacLachlan, **Barbara Park",{"$f":"IF(C16<O10,IF(C16=\"\",\"\",B16),\"\")","v":""},", Lewis Carroll, Pam Conrad, C.S. Lewis"]
[1,{"$f":"Data!A11","v":"**Gary Paulsen"},1,6,0.16666666666666666,{"$f":"IF(C17>=O8,B17,\"\")","v":""},", Jean Fritz, Lois Lowry",{"$f":"IF(C17>=O9,IF(C17<O8,B17,\"\"),\"\")","v":""},", Betsy Byars",{"$f":"IF(C17>=O10,IF(C17<O9,B17,\"\"),\"\")","v":""},"Judy Blome, Patricia MacLachlan, **Barbara Park",{"$f":"IF(C17<O10,IF(C17=\"\",\"\",B17),\"\")","v":"**Gary Paulsen"},", Lewis Carroll, Pam Conrad, C.S. Lewis, **Gary Paulsen"]
[false,{"$f":"Data!A12","v":"Jack Prelutsky"},3,6,0.5,{"$f":"IF(C18>=O8,B18,\"\")","v":""},", Jean Fritz, Lois Lowry",{"$f":"IF(C18>=O9,IF(C18<O8,B18,\"\"),\"\")","v":""},", Betsy Byars",{"$f":"IF(C18>=O10,IF(C18<O9,B18,\"\"),\"\")","v":"Jack Prelutsky"},"Judy Blome, Patricia MacLachlan, **Barbara Park, Jack Prelutsky",{"$f":"IF(C18<O10,IF(C18=\"\",\"\",B18),\"\")","v":""},", Lewis Carroll, Pam Conrad, C.S. Lewis, **Gary Paulsen"]
[false,{"$f":"Data!A13","v":"Cynthia Rylant"},1,6,0.16666666666666666,{"$f":"IF(C19>=O8,B19,\"\")","v":""},", Jean Fritz, Lois Lowry",{"$f":"IF(C19>=O9,IF(C19<O8,B19,\"\"),\"\")","v":""},", Betsy Byars",{"$f":"IF(C19>=O10,IF(C19<O9,B19,\"\"),\"\")","v":""},"Judy Blome, Patricia MacLachlan, **Barbara Park, Jack Prelutsky",{"$f":"IF(C19<O10,IF(C19=\"\",\"\",B19),\"\")","v":"Cynthia Rylant"},", Lewis Carroll, Pam Conrad, C.S. Lewis, **Gary Paulsen, Cynthia Rylant"]
[false,{"$f":"Data!A14","v":"Louis Sachar"},5,6,0.83333333333333337,{"$f":"IF(C20>=O8,B20,\"\")","v":"Louis Sachar"},", Jean Fritz, Lois Lowry, Louis Sachar",{"$f":"IF(C20>=O9,IF(C20<O8,B20,\"\"),\"\")","v":""},", Betsy Byars",{"$f":"IF(C20>=O10,IF(C20<O9,B20,\"\"),\"\")","v":""},"Judy Blome, Patricia MacLachlan, **Barbara Park, Jack Prelutsky",{"$f":"IF(C20<O10,IF(C20=\"\",\"\",B20),\"\")","v":""},", Lewis Carroll, Pam Conrad, C.S. Lewis, **Gary Paulsen, Cynthia Rylant"]
[false,{"$f":"Data!A15","v":"Shel Silverstein"},6,6,1,{"$f":"IF(C21>=O8,B21,\"\")","v":"Shel Silverstein"},", Jean Fritz, Lois Lowry, Louis Sachar, Shel Silverstein",{"$f":"IF(C21>=O9,IF(C21<O8,B21,\"\"),\"\")","v":""},", Betsy Byars",{"$f":"IF(C21>=O10,IF(C21<O9,B21,\"\"),\"\")","v":""},"Judy Blome, Patricia MacLachlan, **Barbara Park, Jack Prelutsky",{"$f":"IF(C21<O10,IF(C21=\"\",\"\",B21),\"\")","v":""},", Lewis Carroll, Pam Conrad, C.S. Lewis, **Gary Paulsen, Cynthia Rylant"]
[false,{"$f":"Data!A16","v":"Seymour Simon"},5,6,0.83333333333333337,{"$f":"IF(C22>=O8,B22,\"\")","v":"Seymour Simon"},", Jean Fritz, Lois Lowry, Louis Sachar, Shel Silverstein, Seymour Simon",{"$f":"IF(C22>=O9,IF(C22<O8,B22,\"\"),\"\")","v":""},", Betsy Byars",{"$f":"IF(C22>=O10,IF(C22<O9,B22,\"\"),\"\")","v":""},"Judy Blome, Patricia MacLachlan, **Barbara Park, Jack Prelutsky",{"$f":"IF(C22<O10,IF(C22=\"\",\"\",B22),\"\")","v":""},", Lewis Carroll, Pam Conrad, C.S. Lewis, **Gary Paulsen, Cynthia Rylant"]
[4,{"$f":"Data!A17","v":"**Jerry Spinelli"},4,6,0.66666666666666663,{"$f":"IF(C23>=O8,B23,\"\")","v":""},", Jean Fritz, Lois Lowry, Louis Sachar, Shel Silverstein, Seymour Simon",{"$f":"IF(C23>=O9,IF(C23<O8,B23,\"\"),\"\")","v":"**Jerry Spinelli"},", Betsy Byars, **Jerry Spinelli",{"$f":"IF(C23>=O10,IF(C23<O9,B23,\"\"),\"\")","v":""},"Judy Blome, Patricia MacLachlan, **Barbara Park, Jack Prelutsky",{"$f":"IF(C23<O10,IF(C23=\"\",\"\",B23),\"\")","v":""},", Lewis Carroll, Pam Conrad, C.S. Lewis, **Gary Paulsen, Cynthia Rylant"]
[false,{"$f":"Data!A18","v":"R.L. Stine"},3,6,0.5,{"$f":"IF(C24>=O8,B24,\"\")","v":""},", Jean Fritz, Lois Lowry, Louis Sachar, Shel Silverstein, Seymour Simon",{"$f":"IF(C24>=O9,IF(C24<O8,B24,\"\"),\"\")","v":""},", Betsy Byars, **Jerry Spinelli",{"$f":"IF(C24>=O10,IF(C24<O9,B24,\"\"),\"\")","v":"R.L. Stine"},"Judy Blome, Patricia MacLachlan, **Barbara Park, Jack Prelutsky, R.L. Stine",{"$f":"IF(C24<O10,IF(C24=\"\",\"\",B24),\"\")","v":""},", Lewis Carroll, Pam Conrad, C.S. Lewis, **Gary Paulsen, Cynthia Rylant"]
[false,{"$f":"Data!A19","v":"Jane Yolen"},5,6,0.83333333333333337,{"$f":"IF(C25>=O8,B25,\"\")","v":"Jane Yolen"},", Jean Fritz, Lois Lowry, Louis Sachar, Shel Silverstein, Seymour Simon, Jane Yolen",{"$f":"IF(C25>=O9,IF(C25<O8,B25,\"\"),\"\")","v":""},", Betsy Byars, **Jerry Spinelli",{"$f":"IF(C25>=O10,IF(C25<O9,B25,\"\"),\"\")","v":""},"Judy Blome, Patricia MacLachlan, **Barbara Park, Jack Prelutsky, R.L. Stine",{"$f":"IF(C25<O10,IF(C25=\"\",\"\",B25),\"\")","v":""},", Lewis Carroll, Pam Conrad, C.S. Lewis, **Gary Paulsen, Cynthia Rylant"]
[false,{"$f":"Data!A20","v":"J.K. Rowling"},1,6,0.16666666666666666,{"$f":"IF(C26>=O8,B26,\"\")","v":""},", Jean Fritz, Lois Lowry, Louis Sachar, Shel Silverstein, Seymour Simon, Jane Yolen",{"$f":"IF(C26>=O9,IF(C26<O8,B26,\"\"),\"\")","v":""},", Betsy Byars, **Jerry Spinelli",{"$f":"IF(C26>=O10,IF(C26<O9,B26,\"\"),\"\")","v":""},"Judy Blome, Patricia MacLachlan, **Barbara Park, Jack Prelutsky, R.L. Stine",{"$f":"IF(C26<O10,IF(C26=\"\",\"\",B26),\"\")","v":"J.K. Rowling"},", Lewis Carroll, Pam Conrad, C.S. Lewis, **Gary Paulsen, Cynthia Rylant, J.K. Rowling"]
["FALSE",{"$f":"Data!A21","v":"Student20"},null,"","",{"$f":"IF(C27>=O8,B27,\"\")","v":""},", Jean Fritz, Lois Lowry, Louis Sachar, Shel Silverstein, Seymour Simon, Jane Yolen",{"$f":"IF(C27>=O9,IF(C27<O8,B27,\"\"),\"\")","v":""},", Betsy Byars, **Jerry Spinelli",{"$f":"IF(C27>=O10,IF(C27<O9,B27,\"\"),\"\")","v":""},"Judy Blome, Patricia MacLachlan, **Barbara Park, Jack Prelutsky, R.L. Stine",{"$f":"IF(C27<O10,IF(C27=\"\",\"\",B27),\"\")","v":""},", Lewis Carroll, Pam Conrad, C.S. Lewis, **Gary Paulsen, Cynthia Rylant, J.K. Rowling"]
["FALSE",{"$f":"Data!A22","v":"Student21"},null,"","",{"$f":"IF(C28>=O8,B28,\"\")","v":""},", Jean Fritz, Lois Lowry, Louis Sachar, Shel Silverstein, Seymour Simon, Jane Yolen",{"$f":"IF(C28>=O9,IF(C28<O8,B28,\"\"),\"\")","v":""},", Betsy Byars, **Jerry Spinelli",{"$f":"IF(C28>=O10,IF(C28<O9,B28,\"\"),\"\")","v":""},"Judy Blome, Patricia MacLachlan, **Barbara Park, Jack Prelutsky, R.L. Stine",{"$f":"IF(C28<O10,IF(C28=\"\",\"\",B28),\"\")","v":""},", Lewis Carroll, Pam Conrad, C.S. Lewis, **Gary Paulsen, Cynthia Rylant, J.K. Rowling"]
["FALSE",{"$f":"Data!A23","v":"Student22"},null,"","",{"$f":"IF(C29>=O8,B29,\"\")","v":""},", Jean Fritz, Lois Lowry, Louis Sachar, Shel Silverstein, Seymour Simon, Jane Yolen",{"$f":"IF(C29>=O9,IF(C29<O8,B29,\"\"),\"\")","v":""},", Betsy Byars, **Jerry Spinelli",{"$f":"IF(C29>=O10,IF(C29<O9,B29,\"\"),\"\")","v":""},"Judy Blome, Patricia MacLachlan, **Barbara Park, Jack Prelutsky, R.L. Stine",{"$f":"IF(C29<O10,IF(C29=\"\",\"\",B29),\"\")","v":""},", Lewis Carroll, Pam Conrad, C.S. Lewis, **Gary Paulsen, Cynthia Rylant, J.K. Rowling"]
["FALSE",{"$f":"Data!A24","v":"Student23"},null,"","",{"$f":"IF(C30>=O8,B30,\"\")","v":""},", Jean Fritz, Lois Lowry, Louis Sachar, Shel Silverstein, Seymour Simon, Jane Yolen",{"$f":"IF(C30>=O9,IF(C30<O8,B30,\"\"),\"\")","v":""},", Betsy Byars, **Jerry Spinelli",{"$f":"IF(C30>=O10,IF(C30<O9,B30,\"\"),\"\")","v":""},"Judy Blome, Patricia MacLachlan, **Barbara Park, Jack Prelutsky, R.L. Stine",{"$f":"IF(C30<O10,IF(C30=\"\",\"\",B30),\"\")","v":""},", Lewis Carroll, Pam Conrad, C.S. Lewis, **Gary Paulsen, Cynthia Rylant, J.K. Rowling"]
["FALSE",{"$f":"Data!A25","v":"Student24"},null,"","",{"$f":"IF(C31>=O8,B31,\"\")","v":""},", Jean Fritz, Lois Lowry, Louis Sachar, Shel Silverstein, Seymour Simon, Jane Yolen",{"$f":"IF(C31>=O9,IF(C31<O8,B31,\"\"),\"\")","v":""},", Betsy Byars, **Jerry Spinelli",{"$f":"IF(C31>=O10,IF(C31<O9,B31,\"\"),\"\")","v":""},"Judy Blome, Patricia MacLachlan, **Barbara Park, Jack Prelutsky, R.L. Stine",{"$f":"IF(C31<O10,IF(C31=\"\",\"\",B31),\"\")","v":""},", Lewis Carroll, Pam Conrad, C.S. Lewis, **Gary Paulsen, Cynthia Rylant, J.K. Rowling"]
["FALSE",{"$f":"Data!A26","v":"Student25"},null,"","",{"$f":"IF(C32>=O8,B32,\"\")","v":""},", Jean Fritz, Lois Lowry, Louis Sachar, Shel Silverstein, Seymour Simon, Jane Yolen",{"$f":"IF(C32>=O9,IF(C32<O8,B32,\"\"),\"\")","v":""},", Betsy Byars, **Jerry Spinelli",{"$f":"IF(C32>=O10,IF(C32<O9,B32,\"\"),\"\")","v":""},"Judy Blome, Patricia MacLachlan, **Barbara Park, Jack Prelutsky, R.L. Stine",{"$f":"IF(C32<O10,IF(C32=\"\",\"\",B32),\"\")","v":""},", Lewis Carroll, Pam Conrad, C.S. Lewis, **Gary Paulsen, Cynthia Rylant, J.K. Rowling"]
["FALSE",{"$f":"Data!A27","v":"Student26"},null,"","",{"$f":"IF(C33>=O8,B33,\"\")","v":""},", Jean Fritz, Lois Lowry, Louis Sachar, Shel Silverstein, Seymour Simon, Jane Yolen",{"$f":"IF(C33>=O9,IF(C33<O8,B33,\"\"),\"\")","v":""},", Betsy Byars, **Jerry Spinelli",{"$f":"IF(C33>=O10,IF(C33<O9,B33,\"\"),\"\")","v":""},"Judy Blome, Patricia MacLachlan, **Barbara Park, Jack Prelutsky, R.L. Stine",{"$f":"IF(C33<O10,IF(C33=\"\",\"\",B33),\"\")","v":""},", Lewis Carroll, Pam Conrad, C.S. Lewis, **Gary Paulsen, Cynthia Rylant, J.K. Rowling"]
["FALSE",{"$f":"Data!A28","v":"Student27"},null,"","",{"$f":"IF(C34>=O8,B34,\"\")","v":""},", Jean Fritz, Lois Lowry, Louis Sachar, Shel Silverstein, Seymour Simon, Jane Yolen",{"$f":"IF(C34>=O9,IF(C34<O8,B34,\"\"),\"\")","v":""},", Betsy Byars, **Jerry Spinelli",{"$f":"IF(C34>=O10,IF(C34<O9,B34,\"\"),\"\")","v":""},"Judy Blome, Patricia MacLachlan, **Barbara Park, Jack Prelutsky, R.L. Stine",{"$f":"IF(C34<O10,IF(C34=\"\",\"\",B34),\"\")","v":""},", Lewis Carroll, Pam Conrad, C.S. Lewis, **Gary Paulsen, Cynthia Rylant, J.K. Rowling"]
["FALSE",{"$f":"Data!A29","v":"Student28"},null,"","",{"$f":"IF(C35>=O8,B35,\"\")","v":""},", Jean Fritz, Lois Lowry, Louis Sachar, Shel Silverstein, Seymour Simon, Jane Yolen",{"$f":"IF(C35>=O9,IF(C35<O8,B35,\"\"),\"\")","v":""},", Betsy Byars, **Jerry Spinelli",{"$f":"IF(C35>=O10,IF(C35<O9,B35,\"\"),\"\")","v":""},"Judy Blome, Patricia MacLachlan, **Barbara Park, Jack Prelutsky, R.L. Stine",{"$f":"IF(C35<O10,IF(C35=\"\",\"\",B35),\"\")","v":""},", Lewis Carroll, Pam Conrad, C.S. Lewis, **Gary Paulsen, Cynthia Rylant, J.K. Rowling"]
["FALSE",{"$f":"Data!A30","v":"Student29"},null,"","",{"$f":"IF(C36>=O8,B36,\"\")","v":""},", Jean Fritz, Lois Lowry, Louis Sachar, Shel Silverstein, Seymour Simon, Jane Yolen",{"$f":"IF(C36>=O9,IF(C36<O8,B36,\"\"),\"\")","v":""},", Betsy Byars, **Jerry Spinelli",{"$f":"IF(C36>=O10,IF(C36<O9,B36,\"\"),\"\")","v":""},"Judy Blome, Patricia MacLachlan, **Barbara Park, Jack Prelutsky, R.L. Stine",{"$f":"IF(C36<O10,IF(C36=\"\",\"\",B36),\"\")","v":""},", Lewis Carroll, Pam Conrad, C.S. Lewis, **Gary Paulsen, Cynthia Rylant, J.K. Rowling"]
["FALSE",{"$f":"Data!A31","v":"Student30"},null,"","",{"$f":"IF(C37>=O8,B37,\"\")","v":""},", Jean Fritz, Lois Lowry, Louis Sachar, Shel Silverstein, Seymour Simon, Jane Yolen",{"$f":"IF(C37>=O9,IF(C37<O8,B37,\"\"),\"\")","v":""},", Betsy Byars, **Jerry Spinelli",{"$f":"IF(C37>=O10,IF(C37<O9,B37,\"\"),\"\")","v":""},"Judy Blome, Patricia MacLachlan, **Barbara Park, Jack Prelutsky, R.L. Stine",{"$f":"IF(C37<O10,IF(C37=\"\",\"\",B37),\"\")","v":""},", Lewis Carroll, Pam Conrad, C.S. Lewis, **Gary Paulsen, Cynthia Rylant, J.K. Rowling"]
["FALSE",null,null,null,""]
[null,"TOTAL",{"$f":"SUM(C8:C37)","v":65},{"$f":"SUM(D8:D37)","v":114},{"$f":"C39/D39","v":0.57017543859649122}]

{"sheet":"Teacher2Pretest","index":7,"n_rows":39,"n_cols":16,"rows_kept":39,"cut":false,"hidden":false,"merged":[[0,3,0,4],[0,1,0,2],[4,1,6,1],[4,3,5,3],[4,4,6,4],[1,1,1,2],[2,1,3,2],[2,3,3,4],[1,3,1,4],[4,2,6,2]]}
[null,{"$f":"IF(Data!N6=\"Other\",Data!N7,Data!N6)","v":"Grade 4"},null,{"$f":"Data!B1","v":"Jones"}]
[null,"Meeting Date:",null,{"$f":"Data!N8","v":"2/26/14"}]
[null,"Assessment:",null,{"$f":"Teacher1Pretest!D3","v":"Main Idea- R.I.4.2"}]
[]
[null,"Student Name","Points","Possible","Score - %"]
[]
[null,null,null,{"$f":"Teacher1Pretest!D7","v":6},null,"Proficient",null,"Close",null,"Far",null,"Intervention"]
[{"$f":"IF(ISBLANK(C8),\"FALSE\",IF(LEFT(B8,2)=\"**\",IF(C8>=$O$8,$O$8,IF(C8>=$O$9,$O$9,IF(C8>=$O$10,$O$10,$O$11)))))","v":5},{"$f":"Data!B2","v":"**Justin Bieber"},5,{"$f":"IF(C8=\"\",\"\",$D$7)","v":6},{"$f":"IF(D8=\"\",\"\",C8/$D$7)","v":0.83333333333333337},{"$f":"IF(C8>=O8,B8,\"\")","v":"**Justin Bieber"},{"$f":"F8","v":"**Justin Bieber"},{"$f":"IF(C8>=O9,IF(C8<O8,B8,\"\"),\"\")","v":""},{"$f":"H8","v":""},{"$f":"IF(C8>=O10,IF(C8<O9,B8,\"\"),\"\")","v":""},{"$f":"J8","v":""},{"$f":"IF(C8<O10,IF(C8=\"\",\"\",B8),\"\")","v":""},{"$f":"L8","v":""},null,{"$f":"Data!N11","v":5},"Proficient"]
[{"$f":"IF(ISBLANK(C9),\"FALSE\",IF(LEFT(B9,2)=\"**\",IF(C9>=$O$8,$O$8,IF(C9>=$O$9,$O$9,IF(C9>=$O$10,$O$10,$O$11)))))","v":false},{"$f":"Data!B3","v":"Taylor Swift"},5,{"$f":"IF(C9=\"\",\"\",$D$7)","v":6},{"$f":"IF(D9=\"\",\"\",C9/$D$7)","v":0.83333333333333337},{"$f":"IF(C9>=O8,B9,\"\")","v":"Taylor Swift"},{"$f":"G8&IF(F9=\"\",\"\",\", \")&F9","v":"**Justin Bieber, Taylor Swift"},{"$f":"IF(C9>=O9,IF(C9<O8,B9,\"\"),\"\")","v":""},{"$f":"I8&IF(H9=\"\",\"\",\", \")&H9","v":""},{"$f":"IF(C9>=O10,IF(C9<O9,B9,\"\"),\"\")","v":""},{"$f":"K8&IF(J9=\"\",\"\",\", \")&J9","v":""},{"$f":"IF(C9<O10,IF(C9=\"\",\"\",B9),\"\")","v":""},{"$f":"M8&IF(L9=\"\",\"\",\", \")&L9","v":""},null,{"$f":"Data!N12","v":4},"Close to Proficient"]
[false,{"$f":"Data!B4","v":"Beyonce Knowles"},5,6,0.83333333333333337,{"$f":"IF(C10>=O8,B10,\"\")","v":"Beyonce Knowles"},{"$f":"G9&IF(F10=\"\",\"\",\", \")&F10","v":"**Justin Bieber, Taylor Swift, Beyonce Knowles"},{"$f":"IF(C10>=O9,IF(C10<O8,B10,\"\"),\"\")","v":""},{"$f":"I9&IF(H10=\"\",\"\",\", \")&H10","v":""},{"$f":"IF(C10>=O10,IF(C10<O9,B10,\"\"),\"\")","v":""},{"$f":"K9&IF(J10=\"\",\"\",\", \")&J10","v":""},{"$f":"IF(C10<O10,IF(C10=\"\",\"\",B10),\"\")","v":""},{"$f":"M9&IF(L10=\"\",\"\",\", \")&L10","v":""},null,{"$f":"Data!N13","v":3},"Far to Go But Likely to Become Proficient"]
[false,{"$f":"Data!B5","v":"Madonna"},4,6,0.66666666666666663,{"$f":"IF(C11>=O8,B11,\"\")","v":""},"**Justin Bieber, Taylor Swift, Beyonce Knowles",{"$f":"IF(C11>=O9,IF(C11<O8,B11,\"\"),\"\")","v":"Madonna"},", Madonna",{"$f":"IF(C11>=O10,IF(C11<O9,B11,\"\"),\"\")","v":""},"",{"$f":"IF(C11<O10,IF(C11=\"\",\"\",B11),\"\")","v":""},"",null,{"$f":"Data!N14","v":1},"Intervention (Far to Go But Not Likely to Become Proficient)"]
[false,{"$f":"Data!B6","v":"Justin Timberlake"},1,6,0.16666666666666666,{"$f":"IF(C12>=O8,B12,\"\")","v":""},"**Justin Bieber, Taylor Swift, Beyonce Knowles",{"$f":"IF(C12>=O9,IF(C12<O8,B12,\"\"),\"\")","v":""},", Madonna",{"$f":"IF(C12>=O10,IF(C12<O9,B12,\"\"),\"\")","v":""},"",{"$f":"IF(C12<O10,IF(C12=\"\",\"\",B12),\"\")","v":"Justin Timberlake"},", Justin Timberlake"]
[false,{"$f":"Data!B7","v":"Bon Jovi"},2,6,0.33333333333333331,{"$f":"IF(C13>=O8,B13,\"\")","v":""},"**Justin Bieber, Taylor Swift, Beyonce Knowles",{"$f":"IF(C13>=O9,IF(C13<O8,B13,\"\"),\"\")","v":""},", Madonna",{"$f":"IF(C13>=O10,IF(C13<O9,B13,\"\"),\"\")","v":""},"",{"$f":"IF(C13<O10,IF(C13=\"\",\"\",B13),\"\")","v":"Bon Jovi"},", Justin Timberlake, Bon Jovi"]
[false,{"$f":"Data!B8","v":"Tim McGraw"},5,6,0.83333333333333337,{"$f":"IF(C14>=O8,B14,\"\")","v":"Tim McGraw"},"**Justin Bieber, Taylor Swift, Beyonce Knowles, Tim McGraw",{"$f":"IF(C14>=O9,IF(C14<O8,B14,\"\"),\"\")","v":""},", Madonna",{"$f":"IF(C14>=O10,IF(C14<O9,B14,\"\"),\"\")","v":""},"",{"$f":"IF(C14<O10,IF(C14=\"\",\"\",B14),\"\")","v":""},", Justin Timberlake, Bon Jovi"]
[false,{"$f":"Data!B9","v":"Elton John"},1,6,0.16666666666666666,{"$f":"IF(C15>=O8,B15,\"\")","v":""},"**Justin Bieber, Taylor Swift, Beyonce Knowles, Tim McGraw",{"$f":"IF(C15>=O9,IF(C15<O8,B15,\"\"),\"\")","v":""},", Madonna",{"$f":"IF(C15>=O10,IF(C15<O9,B15,\"\"),\"\")","v":""},"",{"$f":"IF(C15<O10,IF(C15=\"\",\"\",B15),\"\")","v":"Elton John"},", Justin Timberlake, Bon Jovi, Elton John"]
[5,{"$f":"Data!B10","v":"**Kelly Clarkson"},5,6,0.83333333333333337,{"$f":"IF(C16>=O8,B16,\"\")","v":"**Kelly Clarkson"},"**Justin Bieber, Taylor Swift, Beyonce Knowles, Tim McGraw, **Kelly Clarkson",{"$f":"IF(C16>=O9,IF(C16<O8,B16,\"\"),\"\")","v":""},", Madonna",{"$f":"IF(C16>=O10,IF(C16<O9,B16,\"\"),\"\")","v":""},"",{"$f":"IF(C16<O10,IF(C16=\"\",\"\",B16),\"\")","v":""},", Justin Timberlake, Bon Jovi, Elton John"]
[false,{"$f":"Data!B11","v":"Aretha Franklin"},3,6,0.5,{"$f":"IF(C17>=O8,B17,\"\")","v":""},"**Justin Bieber, Taylor Swift, Beyonce Knowles, Tim McGraw, **Kelly Clarkson",{"$f":"IF(C17>=O9,IF(C17<O8,B17,\"\"),\"\")","v":""},", Madonna",{"$f":"IF(C17>=O10,IF(C17<O9,B17,\"\"),\"\")","v":"Aretha Franklin"},", Aretha Franklin",{"$f":"IF(C17<O10,IF(C17=\"\",\"\",B17),\"\")","v":""},", Justin Timberlake, Bon Jovi, Elton John"]
[false,{"$f":"Data!B12","v":"Lady Gaga"},2,6,0.33333333333333331,{"$f":"IF(C18>=O8,B18,\"\")","v":""},"**Justin Bieber, Taylor Swift, Beyonce Knowles, Tim McGraw, **Kelly Clarkson",{"$f":"IF(C18>=O9,IF(C18<O8,B18,\"\"),\"\")","v":""},", Madonna",{"$f":"IF(C18>=O10,IF(C18<O9,B18,\"\"),\"\")","v":""},", Aretha Franklin",{"$f":"IF(C18<O10,IF(C18=\"\",\"\",B18),\"\")","v":"Lady Gaga"},", Justin Timberlake, Bon Jovi, Elton John, Lady Gaga"]
[false,{"$f":"Data!B13","v":"Billy Joel"},4,6,0.66666666666666663,{"$f":"IF(C19>=O8,B19,\"\")","v":""},"**Justin Bieber, Taylor Swift, Beyonce Knowles, Tim McGraw, **Kelly Clarkson",{"$f":"IF(C19>=O9,IF(C19<O8,B19,\"\"),\"\")","v":"Billy Joel"},", Madonna, Billy Joel",{"$f":"IF(C19>=O10,IF(C19<O9,B19,\"\"),\"\")","v":""},", Aretha Franklin",{"$f":"IF(C19<O10,IF(C19=\"\",\"\",B19),\"\")","v":""},", Justin Timberlake, Bon Jovi, Elton John, Lady Gaga"]
[false,{"$f":"Data!B14","v":"Bruno Mars"},6,6,1,{"$f":"IF(C20>=O8,B20,\"\")","v":"Bruno Mars"},"**Justin Bieber, Taylor Swift, Beyonce Knowles, Tim McGraw, **Kelly Clarkson, Bruno Mars",{"$f":"IF(C20>=O9,IF(C20<O8,B20,\"\"),\"\")","v":""},", Madonna, Billy Joel",{"$f":"IF(C20>=O10,IF(C20<O9,B20,\"\"),\"\")","v":""},", Aretha Franklin",{"$f":"IF(C20<O10,IF(C20=\"\",\"\",B20),\"\")","v":""},", Justin Timberlake, Bon Jovi, Elton John, Lady Gaga"]
[false,{"$f":"Data!B15","v":"Dolly Parton"},3,6,0.5,{"$f":"IF(C21>=O8,B21,\"\")","v":""},"**Justin Bieber, Taylor Swift, Beyonce Knowles, Tim McGraw, **Kelly Clarkson, Bruno Mars",{"$f":"IF(C21>=O9,IF(C21<O8,B21,\"\"),\"\")","v":""},", Madonna, Billy Joel",{"$f":"IF(C21>=O10,IF(C21<O9,B21,\"\"),\"\")","v":"Dolly Parton"},", Aretha Franklin, Dolly Parton",{"$f":"IF(C21<O10,IF(C21=\"\",\"\",B21),\"\")","v":""},", Justin Timberlake, Bon Jovi, Elton John, Lady Gaga"]
[1,{"$f":"Data!B16","v":"**Axl Rose"},2,6,0.33333333333333331,{"$f":"IF(C22>=O8,B22,\"\")","v":""},"**Justin Bieber, Taylor Swift, Beyonce Knowles, Tim McGraw, **Kelly Clarkson, Bruno Mars",{"$f":"IF(C22>=O9,IF(C22<O8,B22,\"\"),\"\")","v":""},", Madonna, Billy Joel",{"$f":"IF(C22>=O10,IF(C22<O9,B22,\"\"),\"\")","v":""},", Aretha Franklin, Dolly Parton",{"$f":"IF(C22<O10,IF(C22=\"\",\"\",B22),\"\")","v":"**Axl Rose"},", Justin Timberlake, Bon Jovi, Elton John, Lady Gaga, **Axl Rose"]
[false,{"$f":"Data!B17","v":"Tony Bennett"},2,6,0.33333333333333331,{"$f":"IF(C23>=O8,B23,\"\")","v":""},"**Justin Bieber, Taylor Swift, Beyonce Knowles, Tim McGraw, **Kelly Clarkson, Bruno Mars",{"$f":"IF(C23>=O9,IF(C23<O8,B23,\"\"),\"\")","v":""},", Madonna, Billy Joel",{"$f":"IF(C23>=O10,IF(C23<O9,B23,\"\"),\"\")","v":""},", Aretha Franklin, Dolly Parton",{"$f":"IF(C23<O10,IF(C23=\"\",\"\",B23),\"\")","v":"Tony Bennett"},", Justin Timberlake, Bon Jovi, Elton John, Lady Gaga, **Axl Rose, Tony Bennett"]
[false,{"$f":"Data!B18","v":"Pat Benatar"},1,6,0.16666666666666666,{"$f":"IF(C24>=O8,B24,\"\")","v":""},"**Justin Bieber, Taylor Swift, Beyonce Knowles, Tim McGraw, **Kelly Clarkson, Bruno Mars",{"$f":"IF(C24>=O9,IF(C24<O8,B24,\"\"),\"\")","v":""},", Madonna, Billy Joel",{"$f":"IF(C24>=O10,IF(C24<O9,B24,\"\"),\"\")","v":""},", Aretha Franklin, Dolly Parton",{"$f":"IF(C24<O10,IF(C24=\"\",\"\",B24),\"\")","v":"Pat Benatar"},", Justin Timberlake, Bon Jovi, Elton John, Lady Gaga, **Axl Rose, Tony Bennett, Pat Benatar"]
[5,{"$f":"Data!B19","v":"**Bob Dylan"},5,6,0.83333333333333337,{"$f":"IF(C25>=O8,B25,\"\")","v":"**Bob Dylan"},"**Justin Bieber, Taylor Swift, Beyonce Knowles, Tim McGraw, **Kelly Clarkson, Bruno Mars, **Bob Dylan",{"$f":"IF(C25>=O9,IF(C25<O8,B25,\"\"),\"\")","v":""},", Madonna, Billy Joel",{"$f":"IF(C25>=O10,IF(C25<O9,B25,\"\"),\"\")","v":""},", Aretha Franklin, Dolly Parton",{"$f":"IF(C25<O10,IF(C25=\"\",\"\",B25),\"\")","v":""},", Justin Timberlake, Bon Jovi, Elton John, Lady Gaga, **Axl Rose, Tony Bennett, Pat Benatar"]
[false,{"$f":"Data!B20","v":"Eric Clapton"},3,6,0.5,{"$f":"IF(C26>=O8,B26,\"\")","v":""},"**Justin Bieber, Taylor Swift, Beyonce Knowles, Tim McGraw, **Kelly Clarkson, Bruno Mars, **Bob Dylan",{"$f":"IF(C26>=O9,IF(C26<O8,B26,\"\"),\"\")","v":""},", Madonna, Billy Joel",{"$f":"IF(C26>=O10,IF(C26<O9,B26,\"\"),\"\")","v":"Eric Clapton"},", Aretha Franklin, Dolly Parton, Eric Clapton",{"$f":"IF(C26<O10,IF(C26=\"\",\"\",B26),\"\")","v":""},", Justin Timberlake, Bon Jovi, Elton John, Lady Gaga, **Axl Rose, Tony Bennett, Pat Benatar"]
[false,{"$f":"Data!B21","v":"Paul McCartney"},2,6,0.33333333333333331,{"$f":"IF(C27>=O8,B27,\"\")","v":""},"**Justin Bieber, Taylor Swift, Beyonce Knowles, Tim McGraw, **Kelly Clarkson, Bruno Mars, **Bob Dylan",{"$f":"IF(C27>=O9,IF(C27<O8,B27,\"\"),\"\")","v":""},", Madonna, Billy Joel",{"$f":"IF(C27>=O10,IF(C27<O9,B27,\"\"),\"\")","v":""},", Aretha Franklin, Dolly Parton, Eric Clapton",{"$f":"IF(C27<O10,IF(C27=\"\",\"\",B27),\"\")","v":"Paul McCartney"},", Justin Timberlake, Bon Jovi, Elton John, Lady Gaga, **Axl Rose, Tony Bennett, Pat Benatar, Paul McCartney"]
[4,{"$f":"Data!B22","v":"**Mick Jagger"},4,6,0.66666666666666663,{"$f":"IF(C28>=O8,B28,\"\")","v":""},"**Justin Bieber, Taylor Swift, Beyonce Knowles, Tim McGraw, **Kelly Clarkson, Bruno Mars, **Bob Dylan",{"$f":"IF(C28>=O9,IF(C28<O8,B28,\"\"),\"\")","v":"**Mick Jagger"},", Madonna, Billy Joel, **Mick Jagger",{"$f":"IF(C28>=O10,IF(C28<O9,B28,\"\"),\"\")","v":""},", Aretha Franklin, Dolly Parton, Eric Clapton",{"$f":"IF(C28<O10,IF(C28=\"\",\"\",B28),\"\")","v":""},", Justin Timberlake, Bon Jovi, Elton John, Lady Gaga, **Axl Rose, Tony Bennett, Pat Benatar, Paul McCartney"]
["FALSE",{"$f":"Data!B23","v":"Student22"},null,"","",{"$f":"IF(C29>=O8,B29,\"\")","v":""},"**Justin Bieber, Taylor Swift, Beyonce Knowles, Tim McGraw, **Kelly Clarkson, Bruno Mars, **Bob Dylan",{"$f":"IF(C29>=O9,IF(C29<O8,B29,\"\"),\"\")","v":""},", Madonna, Billy Joel, **Mick Jagger",{"$f":"IF(C29>=O10,IF(C29<O9,B29,\"\"),\"\")","v":""},", Aretha Franklin, Dolly Parton, Eric Clapton",{"$f":"IF(C29<O10,IF(C29=\"\",\"\",B29),\"\")","v":""},", Justin Timberlake, Bon Jovi, Elton John, Lady Gaga, **Axl Rose, Tony Bennett, Pat Benatar, Paul McCartney"]
["FALSE",{"$f":"Data!B24","v":"Student23"},null,"","",{"$f":"IF(C30>=O8,B30,\"\")","v":""},"**Justin Bieber, Taylor Swift, Beyonce Knowles, Tim McGraw, **Kelly Clarkson, Bruno Mars, **Bob Dylan",{"$f":"IF(C30>=O9,IF(C30<O8,B30,\"\"),\"\")","v":""},", Madonna, Billy Joel, **Mick Jagger",{"$f":"IF(C30>=O10,IF(C30<O9,B30,\"\"),\"\")","v":""},", Aretha Franklin, Dolly Parton, Eric Clapton",{"$f":"IF(C30<O10,IF(C30=\"\",\"\",B30),\"\")","v":""},", Justin Timberlake, Bon Jovi, Elton John, Lady Gaga, **Axl Rose, Tony Bennett, Pat Benatar, Paul McCartney"]
["FALSE",{"$f":"Data!B25","v":"Student24"},null,"","",{"$f":"IF(C31>=O8,B31,\"\")","v":""},"**Justin Bieber, Taylor Swift, Beyonce Knowles, Tim McGraw, **Kelly Clarkson, Bruno Mars, **Bob Dylan",{"$f":"IF(C31>=O9,IF(C31<O8,B31,\"\"),\"\")","v":""},", Madonna, Billy Joel, **Mick Jagger",{"$f":"IF(C31>=O10,IF(C31<O9,B31,\"\"),\"\")","v":""},", Aretha Franklin, Dolly Parton, Eric Clapton",{"$f":"IF(C31<O10,IF(C31=\"\",\"\",B31),\"\")","v":""},", Justin Timberlake, Bon Jovi, Elton John, Lady Gaga, **Axl Rose, Tony Bennett, Pat Benatar, Paul McCartney"]
["FALSE",{"$f":"Data!B26","v":"Student25"},null,"","",{"$f":"IF(C32>=O8,B32,\"\")","v":""},"**Justin Bieber, Taylor Swift, Beyonce Knowles, Tim McGraw, **Kelly Clarkson, Bruno Mars, **Bob Dylan",{"$f":"IF(C32>=O9,IF(C32<O8,B32,\"\"),\"\")","v":""},", Madonna, Billy Joel, **Mick Jagger",{"$f":"IF(C32>=O10,IF(C32<O9,B32,\"\"),\"\")","v":""},", Aretha Franklin, Dolly Parton, Eric Clapton",{"$f":"IF(C32<O10,IF(C32=\"\",\"\",B32),\"\")","v":""},", Justin Timberlake, Bon Jovi, Elton John, Lady Gaga, **Axl Rose, Tony Bennett, Pat Benatar, Paul McCartney"]
["FALSE",{"$f":"Data!B27","v":"Student26"},null,"","",{"$f":"IF(C33>=O8,B33,\"\")","v":""},"**Justin Bieber, Taylor Swift, Beyonce Knowles, Tim McGraw, **Kelly Clarkson, Bruno Mars, **Bob Dylan",{"$f":"IF(C33>=O9,IF(C33<O8,B33,\"\"),\"\")","v":""},", Madonna, Billy Joel, **Mick Jagger",{"$f":"IF(C33>=O10,IF(C33<O9,B33,\"\"),\"\")","v":""},", Aretha Franklin, Dolly Parton, Eric Clapton",{"$f":"IF(C33<O10,IF(C33=\"\",\"\",B33),\"\")","v":""},", Justin Timberlake, Bon Jovi, Elton John, Lady Gaga, **Axl Rose, Tony Bennett, Pat Benatar, Paul McCartney"]
["FALSE",{"$f":"Data!B28","v":"Student27"},null,"","",{"$f":"IF(C34>=O8,B34,\"\")","v":""},"**Justin Bieber, Taylor Swift, Beyonce Knowles, Tim McGraw, **Kelly Clarkson, Bruno Mars, **Bob Dylan",{"$f":"IF(C34>=O9,IF(C34<O8,B34,\"\"),\"\")","v":""},", Madonna, Billy Joel, **Mick Jagger",{"$f":"IF(C34>=O10,IF(C34<O9,B34,\"\"),\"\")","v":""},", Aretha Franklin, Dolly Parton, Eric Clapton",{"$f":"IF(C34<O10,IF(C34=\"\",\"\",B34),\"\")","v":""},", Justin Timberlake, Bon Jovi, Elton John, Lady Gaga, **Axl Rose, Tony Bennett, Pat Benatar, Paul McCartney"]
["FALSE",{"$f":"Data!B29","v":"Student28"},null,"","",{"$f":"IF(C35>=O8,B35,\"\")","v":""},"**Justin Bieber, Taylor Swift, Beyonce Knowles, Tim McGraw, **Kelly Clarkson, Bruno Mars, **Bob Dylan",{"$f":"IF(C35>=O9,IF(C35<O8,B35,\"\"),\"\")","v":""},", Madonna, Billy Joel, **Mick Jagger",{"$f":"IF(C35>=O10,IF(C35<O9,B35,\"\"),\"\")","v":""},", Aretha Franklin, Dolly Parton, Eric Clapton",{"$f":"IF(C35<O10,IF(C35=\"\",\"\",B35),\"\")","v":""},", Justin Timberlake, Bon Jovi, Elton John, Lady Gaga, **Axl Rose, Tony Bennett, Pat Benatar, Paul McCartney"]
["FALSE",{"$f":"Data!B30","v":"Student29"},null,"","",{"$f":"IF(C36>=O8,B36,\"\")","v":""},"**Justin Bieber, Taylor Swift, Beyonce Knowles, Tim McGraw, **Kelly Clarkson, Bruno Mars, **Bob Dylan",{"$f":"IF(C36>=O9,IF(C36<O8,B36,\"\"),\"\")","v":""},", Madonna, Billy Joel, **Mick Jagger",{"$f":"IF(C36>=O10,IF(C36<O9,B36,\"\"),\"\")","v":""},", Aretha Franklin, Dolly Parton, Eric Clapton",{"$f":"IF(C36<O10,IF(C36=\"\",\"\",B36),\"\")","v":""},", Justin Timberlake, Bon Jovi, Elton John, Lady Gaga, **Axl Rose, Tony Bennett, Pat Benatar, Paul McCartney"]
["FALSE",{"$f":"Data!B31","v":"Student30"},null,"","",{"$f":"IF(C37>=O8,B37,\"\")","v":""},"**Justin Bieber, Taylor Swift, Beyonce Knowles, Tim McGraw, **Kelly Clarkson, Bruno Mars, **Bob Dylan",{"$f":"IF(C37>=O9,IF(C37<O8,B37,\"\"),\"\")","v":""},", Madonna, Billy Joel, **Mick Jagger",{"$f":"IF(C37>=O10,IF(C37<O9,B37,\"\"),\"\")","v":""},", Aretha Franklin, Dolly Parton, Eric Clapton",{"$f":"IF(C37<O10,IF(C37=\"\",\"\",B37),\"\")","v":""},", Justin Timberlake, Bon Jovi, Elton John, Lady Gaga, **Axl Rose, Tony Bennett, Pat Benatar, Paul McCartney"]
["FALSE"]
[null,"TOTAL",{"$f":"SUM(C8:C37)","v":70},{"$f":"SUM(D8:D37)","v":126},{"$f":"C39/D39","v":0.55555555555555558}]

{"sheet":"Teacher3Pretest","index":8,"n_rows":39,"n_cols":16,"rows_kept":39,"cut":false,"hidden":false,"merged":[[0,3,0,4],[0,1,0,2],[4,1,6,1],[4,3,5,3],[4,4,6,4],[1,1,1,2],[2,1,3,2],[2,3,3,4],[1,3,1,4],[4,2,6,2]]}
[null,{"$f":"IF(Data!N6=\"Other\",Data!N7,Data!N6)","v":"Grade 4"},null,{"$f":"Data!C1","v":"Gibson"}]
[null,"Meeting Date:",null,{"$f":"Data!N8","v":"2/26/14"}]
[null,"Assessment:",null,{"$f":"Teacher1Pretest!D3","v":"Main Idea- R.I.4.2"}]
[]
[null,"Student Name","Points","Possible","Score - %"]
[]
[null,null,null,{"$f":"Teacher1Pretest!D7","v":6},null,"Proficient",null,"Close",null,"Far",null,"Intervention"]
[{"$f":"IF(ISBLANK(C8),\"FALSE\",IF(LEFT(B8,2)=\"**\",IF(C8>=$O$8,$O$8,IF(C8>=$O$9,$O$9,IF(C8>=$O$10,$O$10,$O$11)))))","v":4},{"$f":"Data!C2","v":"**Albert Einstein"},4,{"$f":"IF(C8=\"\",\"\",$D$7)","v":6},{"$f":"IF(D8=\"\",\"\",C8/$D$7)","v":0.66666666666666663},{"$f":"IF(C8>=O8,B8,\"\")","v":""},{"$f":"F8","v":""},{"$f":"IF(C8>=O9,IF(C8<O8,B8,\"\"),\"\")","v":"**Albert Einstein"},{"$f":"H8","v":"**Albert Einstein"},{"$f":"IF(C8>=O10,IF(C8<O9,B8,\"\"),\"\")","v":""},{"$f":"J8","v":""},{"$f":"IF(C8<O10,IF(C8=\"\",\"\",B8),\"\")","v":""},{"$f":"L8","v":""},null,{"$f":"Teacher1Pretest!O8","v":5},"Proficient"]
[{"$f":"IF(ISBLANK(C9),\"FALSE\",IF(LEFT(B9,2)=\"**\",IF(C9>=$O$8,$O$8,IF(C9>=$O$9,$O$9,IF(C9>=$O$10,$O$10,$O$11)))))","v":false},{"$f":"Data!C3","v":"Alfred Nobel"},1,{"$f":"IF(C9=\"\",\"\",$D$7)","v":6},{"$f":"IF(D9=\"\",\"\",C9/$D$7)","v":0.16666666666666666},{"$f":"IF(C9>=O8,B9,\"\")","v":""},{"$f":"G8&IF(F9=\"\",\"\",\", \")&F9","v":""},{"$f":"IF(C9>=O9,IF(C9<O8,B9,\"\"),\"\")","v":""},{"$f":"I8&IF(H9=\"\",\"\",\", \")&H9","v":"**Albert Einstein"},{"$f":"IF(C9>=O10,IF(C9<O9,B9,\"\"),\"\")","v":""},{"$f":"K8&IF(J9=\"\",\"\",\", \")&J9","v":""},{"$f":"IF(C9<O10,IF(C9=\"\",\"\",B9),\"\")","v":"Alfred Nobel"},{"$f":"M8&IF(L9=\"\",\"\",\", \")&L9","v":", Alfred Nobel"},null,{"$f":"Teacher1Pretest!O9","v":4},"Close to Proficient"]
[false,{"$f":"Data!C4","v":"Benjamin Franklin"},4,6,0.66666666666666663,{"$f":"IF(C10>=O8,B10,\"\")","v":""},{"$f":"G9&IF(F10=\"\",\"\",\", \")&F10","v":""},{"$f":"IF(C10>=O9,IF(C10<O8,B10,\"\"),\"\")","v":"Benjamin Franklin"},{"$f":"I9&IF(H10=\"\",\"\",\", \")&H10","v":"**Albert Einstein, Benjamin Franklin"},{"$f":"IF(C10>=O10,IF(C10<O9,B10,\"\"),\"\")","v":""},{"$f":"K9&IF(J10=\"\",\"\",\", \")&J10","v":""},{"$f":"IF(C10<O10,IF(C10=\"\",\"\",B10),\"\")","v":""},{"$f":"M9&IF(L10=\"\",\"\",\", \")&L10","v":", Alfred Nobel"},null,{"$f":"Teacher1Pretest!O10","v":3},"Far to Go But Likely to Become Proficient"]
[false,{"$f":"Data!C5","v":"Carl Sagan*"},5,6,0.83333333333333337,{"$f":"IF(C11>=O8,B11,\"\")","v":"Carl Sagan*"},", Carl Sagan*",{"$f":"IF(C11>=O9,IF(C11<O8,B11,\"\"),\"\")","v":""},"**Albert Einstein, Benjamin Franklin",{"$f":"IF(C11>=O10,IF(C11<O9,B11,\"\"),\"\")","v":""},"",{"$f":"IF(C11<O10,IF(C11=\"\",\"\",B11),\"\")","v":""},", Alfred Nobel",null,{"$f":"Teacher1Pretest!O11","v":1},"Intervention (Far to Go But Not Likely to Become Proficient)"]
[false,{"$f":"Data!C6","v":"Charles Darwin"},2,6,0.33333333333333331,{"$f":"IF(C12>=O8,B12,\"\")","v":""},", Carl Sagan*",{"$f":"IF(C12>=O9,IF(C12<O8,B12,\"\"),\"\")","v":""},"**Albert Einstein, Benjamin Franklin",{"$f":"IF(C12>=O10,IF(C12<O9,B12,\"\"),\"\")","v":""},"",{"$f":"IF(C12<O10,IF(C12=\"\",\"\",B12),\"\")","v":"Charles Darwin"},", Alfred Nobel, Charles Darwin"]
[false,{"$f":"Data!C7","v":"Henry Ford"},3,6,0.5,{"$f":"IF(C13>=O8,B13,\"\")","v":""},", Carl Sagan*",{"$f":"IF(C13>=O9,IF(C13<O8,B13,\"\"),\"\")","v":""},"**Albert Einstein, Benjamin Franklin",{"$f":"IF(C13>=O10,IF(C13<O9,B13,\"\"),\"\")","v":"Henry Ford"},", Henry Ford",{"$f":"IF(C13<O10,IF(C13=\"\",\"\",B13),\"\")","v":""},", Alfred Nobel, Charles Darwin"]
[1,{"$f":"Data!C8","v":"**Isaac Newton"},2,6,0.33333333333333331,{"$f":"IF(C14>=O8,B14,\"\")","v":""},", Carl Sagan*",{"$f":"IF(C14>=O9,IF(C14<O8,B14,\"\"),\"\")","v":""},"**Albert Einstein, Benjamin Franklin",{"$f":"IF(C14>=O10,IF(C14<O9,B14,\"\"),\"\")","v":""},", Henry Ford",{"$f":"IF(C14<O10,IF(C14=\"\",\"\",B14),\"\")","v":"**Isaac Newton"},", Alfred Nobel, Charles Darwin, **Isaac Newton"]
[false,{"$f":"Data!C9","v":"Ivan Pavlov"},2,6,0.33333333333333331,{"$f":"IF(C15>=O8,B15,\"\")","v":""},", Carl Sagan*",{"$f":"IF(C15>=O9,IF(C15<O8,B15,\"\"),\"\")","v":""},"**Albert Einstein, Benjamin Franklin",{"$f":"IF(C15>=O10,IF(C15<O9,B15,\"\"),\"\")","v":""},", Henry Ford",{"$f":"IF(C15<O10,IF(C15=\"\",\"\",B15),\"\")","v":"Ivan Pavlov"},", Alfred Nobel, Charles Darwin, **Isaac Newton, Ivan Pavlov"]
[false,{"$f":"Data!C10","v":"Jane Goodall"},2,6,0.33333333333333331,{"$f":"IF(C16>=O8,B16,\"\")","v":""},", Carl Sagan*",{"$f":"IF(C16>=O9,IF(C16<O8,B16,\"\"),\"\")","v":""},"**Albert Einstein, Benjamin Franklin",{"$f":"IF(C16>=O10,IF(C16<O9,B16,\"\"),\"\")","v":""},", Henry Ford",{"$f":"IF(C16<O10,IF(C16=\"\",\"\",B16),\"\")","v":"Jane Goodall"},", Alfred Nobel, Charles Darwin, **Isaac Newton, Ivan Pavlov, Jane Goodall"]
[false,{"$f":"Data!C11","v":"Jean Piaget"},2,6,0.33333333333333331,{"$f":"IF(C17>=O8,B17,\"\")","v":""},", Carl Sagan*",{"$f":"IF(C17>=O9,IF(C17<O8,B17,\"\"),\"\")","v":""},"**Albert Einstein, Benjamin Franklin",{"$f":"IF(C17>=O10,IF(C17<O9,B17,\"\"),\"\")","v":""},", Henry Ford",{"$f":"IF(C17<O10,IF(C17=\"\",\"\",B17),\"\")","v":"Jean Piaget"},", Alfred Nobel, Charles Darwin, **Isaac Newton, Ivan Pavlov, Jane Goodall, Jean Piaget"]
[1,{"$f":"Data!C12","v":"**Jonas Salk"},1,6,0.16666666666666666,{"$f":"IF(C18>=O8,B18,\"\")","v":""},", Carl Sagan*",{"$f":"IF(C18>=O9,IF(C18<O8,B18,\"\"),\"\")","v":""},"**Albert Einstein, Benjamin Franklin",{"$f":"IF(C18>=O10,IF(C18<O9,B18,\"\"),\"\")","v":""},", Henry Ford",{"$f":"IF(C18<O10,IF(C18=\"\",\"\",B18),\"\")","v":"**Jonas Salk"},", Alfred Nobel, Charles Darwin, **Isaac Newton, Ivan Pavlov, Jane Goodall, Jean Piaget, **Jonas Salk"]
[5,{"$f":"Data!C13","v":"**Marie Curie"},5,6,0.83333333333333337,{"$f":"IF(C19>=O8,B19,\"\")","v":"**Marie Curie"},", Carl Sagan*, **Marie Curie",{"$f":"IF(C19>=O9,IF(C19<O8,B19,\"\"),\"\")","v":""},"**Albert Einstein, Benjamin Franklin",{"$f":"IF(C19>=O10,IF(C19<O9,B19,\"\"),\"\")","v":""},", Henry Ford",{"$f":"IF(C19<O10,IF(C19=\"\",\"\",B19),\"\")","v":""},", Alfred Nobel, Charles Darwin, **Isaac Newton, Ivan Pavlov, Jane Goodall, Jean Piaget, **Jonas Salk"]
[false,{"$f":"Data!C14","v":"Sigmund Freud"},6,6,1,{"$f":"IF(C20>=O8,B20,\"\")","v":"Sigmund Freud"},", Carl Sagan*, **Marie Curie, Sigmund Freud",{"$f":"IF(C20>=O9,IF(C20<O8,B20,\"\"),\"\")","v":""},"**Albert Einstein, Benjamin Franklin",{"$f":"IF(C20>=O10,IF(C20<O9,B20,\"\"),\"\")","v":""},", Henry Ford",{"$f":"IF(C20<O10,IF(C20=\"\",\"\",B20),\"\")","v":""},", Alfred Nobel, Charles Darwin, **Isaac Newton, Ivan Pavlov, Jane Goodall, Jean Piaget, **Jonas Salk"]
[false,{"$f":"Data!C15","v":"Stephen Hawking"},5,6,0.83333333333333337,{"$f":"IF(C21>=O8,B21,\"\")","v":"Stephen Hawking"},", Carl Sagan*, **Marie Curie, Sigmund Freud, Stephen Hawking",{"$f":"IF(C21>=O9,IF(C21<O8,B21,\"\"),\"\")","v":""},"**Albert Einstein, Benjamin Franklin",{"$f":"IF(C21>=O10,IF(C21<O9,B21,\"\"),\"\")","v":""},", Henry Ford",{"$f":"IF(C21<O10,IF(C21=\"\",\"\",B21),\"\")","v":""},", Alfred Nobel, Charles Darwin, **Isaac Newton, Ivan Pavlov, Jane Goodall, Jean Piaget, **Jonas Salk"]
[false,{"$f":"Data!C16","v":"Thomas Edison"},2,6,0.33333333333333331,{"$f":"IF(C22>=O8,B22,\"\")","v":""},", Carl Sagan*, **Marie Curie, Sigmund Freud, Stephen Hawking",{"$f":"IF(C22>=O9,IF(C22<O8,B22,\"\"),\"\")","v":""},"**Albert Einstein, Benjamin Franklin",{"$f":"IF(C22>=O10,IF(C22<O9,B22,\"\"),\"\")","v":""},", Henry Ford",{"$f":"IF(C22<O10,IF(C22=\"\",\"\",B22),\"\")","v":"Thomas Edison"},", Alfred Nobel, Charles Darwin, **Isaac Newton, Ivan Pavlov, Jane Goodall, Jean Piaget, **Jonas Salk, Thomas Edison"]
[false,{"$f":"Data!C17","v":"John Dewey"},4,6,0.66666666666666663,{"$f":"IF(C23>=O8,B23,\"\")","v":""},", Carl Sagan*, **Marie Curie, Sigmund Freud, Stephen Hawking",{"$f":"IF(C23>=O9,IF(C23<O8,B23,\"\"),\"\")","v":"John Dewey"},"**Albert Einstein, Benjamin Franklin, John Dewey",{"$f":"IF(C23>=O10,IF(C23<O9,B23,\"\"),\"\")","v":""},", Henry Ford",{"$f":"IF(C23<O10,IF(C23=\"\",\"\",B23),\"\")","v":""},", Alfred Nobel, Charles Darwin, **Isaac Newton, Ivan Pavlov, Jane Goodall, Jean Piaget, **Jonas Salk, Thomas Edison"]
[4,{"$f":"Data!C18","v":"**B.F. Skinner"},4,6,0.66666666666666663,{"$f":"IF(C24>=O8,B24,\"\")","v":""},", Carl Sagan*, **Marie Curie, Sigmund Freud, Stephen Hawking",{"$f":"IF(C24>=O9,IF(C24<O8,B24,\"\"),\"\")","v":"**B.F. Skinner"},"**Albert Einstein, Benjamin Franklin, John Dewey, **B.F. Skinner",{"$f":"IF(C24>=O10,IF(C24<O9,B24,\"\"),\"\")","v":""},", Henry Ford",{"$f":"IF(C24<O10,IF(C24=\"\",\"\",B24),\"\")","v":""},", Alfred Nobel, Charles Darwin, **Isaac Newton, Ivan Pavlov, Jane Goodall, Jean Piaget, **Jonas Salk, Thomas Edison"]
[false,{"$f":"Data!C19","v":"Howard Gardner"},5,6,0.83333333333333337,{"$f":"IF(C25>=O8,B25,\"\")","v":"Howard Gardner"},", Carl Sagan*, **Marie Curie, Sigmund Freud, Stephen Hawking, Howard Gardner",{"$f":"IF(C25>=O9,IF(C25<O8,B25,\"\"),\"\")","v":""},"**Albert Einstein, Benjamin Franklin, John Dewey, **B.F. Skinner",{"$f":"IF(C25>=O10,IF(C25<O9,B25,\"\"),\"\")","v":""},", Henry Ford",{"$f":"IF(C25<O10,IF(C25=\"\",\"\",B25),\"\")","v":""},", Alfred Nobel, Charles Darwin, **Isaac Newton, Ivan Pavlov, Jane Goodall, Jean Piaget, **Jonas Salk, Thomas Edison"]
[false,{"$f":"Data!C20","v":"Lev Vygotsky"},4,6,0.66666666666666663,{"$f":"IF(C26>=O8,B26,\"\")","v":""},", Carl Sagan*, **Marie Curie, Sigmund Freud, Stephen Hawking, Howard Gardner",{"$f":"IF(C26>=O9,IF(C26<O8,B26,\"\"),\"\")","v":"Lev Vygotsky"},"**Albert Einstein, Benjamin Franklin, John Dewey, **B.F. Skinner, Lev Vygotsky",{"$f":"IF(C26>=O10,IF(C26<O9,B26,\"\"),\"\")","v":""},", Henry Ford",{"$f":"IF(C26<O10,IF(C26=\"\",\"\",B26),\"\")","v":""},", Alfred Nobel, Charles Darwin, **Isaac Newton, Ivan Pavlov, Jane Goodall, Jean Piaget, **Jonas Salk, Thomas Edison"]
[false,{"$f":"Data!C21","v":"Maria Montessori"},3,6,0.5,{"$f":"IF(C27>=O8,B27,\"\")","v":""},", Carl Sagan*, **Marie Curie, Sigmund Freud, Stephen Hawking, Howard Gardner",{"$f":"IF(C27>=O9,IF(C27<O8,B27,\"\"),\"\")","v":""},"**Albert Einstein, Benjamin Franklin, John Dewey, **B.F. Skinner, Lev Vygotsky",{"$f":"IF(C27>=O10,IF(C27<O9,B27,\"\"),\"\")","v":"Maria Montessori"},", Henry Ford, Maria Montessori",{"$f":"IF(C27<O10,IF(C27=\"\",\"\",B27),\"\")","v":""},", Alfred Nobel, Charles Darwin, **Isaac Newton, Ivan Pavlov, Jane Goodall, Jean Piaget, **Jonas Salk, Thomas Edison"]
["FALSE",{"$f":"Data!C22","v":"Student21"},null,"","",{"$f":"IF(C28>=O8,B28,\"\")","v":""},", Carl Sagan*, **Marie Curie, Sigmund Freud, Stephen Hawking, Howard Gardner",{"$f":"IF(C28>=O9,IF(C28<O8,B28,\"\"),\"\")","v":""},"**Albert Einstein, Benjamin Franklin, John Dewey, **B.F. Skinner, Lev Vygotsky",{"$f":"IF(C28>=O10,IF(C28<O9,B28,\"\"),\"\")","v":""},", Henry Ford, Maria Montessori",{"$f":"IF(C28<O10,IF(C28=\"\",\"\",B28),\"\")","v":""},", Alfred Nobel, Charles Darwin, **Isaac Newton, Ivan Pavlov, Jane Goodall, Jean Piaget, **Jonas Salk, Thomas Edison"]
["FALSE",{"$f":"Data!C23","v":"Student22"},null,"","",{"$f":"IF(C29>=O8,B29,\"\")","v":""},", Carl Sagan*, **Marie Curie, Sigmund Freud, Stephen Hawking, Howard Gardner",{"$f":"IF(C29>=O9,IF(C29<O8,B29,\"\"),\"\")","v":""},"**Albert Einstein, Benjamin Franklin, John Dewey, **B.F. Skinner, Lev Vygotsky",{"$f":"IF(C29>=O10,IF(C29<O9,B29,\"\"),\"\")","v":""},", Henry Ford, Maria Montessori",{"$f":"IF(C29<O10,IF(C29=\"\",\"\",B29),\"\")","v":""},", Alfred Nobel, Charles Darwin, **Isaac Newton, Ivan Pavlov, Jane Goodall, Jean Piaget, **Jonas Salk, Thomas Edison"]
["FALSE",{"$f":"Data!C24","v":"Student23"},null,"","",{"$f":"IF(C30>=O8,B30,\"\")","v":""},", Carl Sagan*, **Marie Curie, Sigmund Freud, Stephen Hawking, Howard Gardner",{"$f":"IF(C30>=O9,IF(C30<O8,B30,\"\"),\"\")","v":""},"**Albert Einstein, Benjamin Franklin, John Dewey, **B.F. Skinner, Lev Vygotsky",{"$f":"IF(C30>=O10,IF(C30<O9,B30,\"\"),\"\")","v":""},", Henry Ford, Maria Montessori",{"$f":"IF(C30<O10,IF(C30=\"\",\"\",B30),\"\")","v":""},", Alfred Nobel, Charles Darwin, **Isaac Newton, Ivan Pavlov, Jane Goodall, Jean Piaget, **Jonas Salk, Thomas Edison"]
["FALSE",{"$f":"Data!C25","v":"Student24"},null,"","",{"$f":"IF(C31>=O8,B31,\"\")","v":""},", Carl Sagan*, **Marie Curie, Sigmund Freud, Stephen Hawking, Howard Gardner",{"$f":"IF(C31>=O9,IF(C31<O8,B31,\"\"),\"\")","v":""},"**Albert Einstein, Benjamin Franklin, John Dewey, **B.F. Skinner, Lev Vygotsky",{"$f":"IF(C31>=O10,IF(C31<O9,B31,\"\"),\"\")","v":""},", Henry Ford, Maria Montessori",{"$f":"IF(C31<O10,IF(C31=\"\",\"\",B31),\"\")","v":""},", Alfred Nobel, Charles Darwin, **Isaac Newton, Ivan Pavlov, Jane Goodall, Jean Piaget, **Jonas Salk, Thomas Edison"]
["FALSE",{"$f":"Data!C26","v":"Student25"},null,"","",{"$f":"IF(C32>=O8,B32,\"\")","v":""},", Carl Sagan*, **Marie Curie, Sigmund Freud, Stephen Hawking, Howard Gardner",{"$f":"IF(C32>=O9,IF(C32<O8,B32,\"\"),\"\")","v":""},"**Albert Einstein, Benjamin Franklin, John Dewey, **B.F. Skinner, Lev Vygotsky",{"$f":"IF(C32>=O10,IF(C32<O9,B32,\"\"),\"\")","v":""},", Henry Ford, Maria Montessori",{"$f":"IF(C32<O10,IF(C32=\"\",\"\",B32),\"\")","v":""},", Alfred Nobel, Charles Darwin, **Isaac Newton, Ivan Pavlov, Jane Goodall, Jean Piaget, **Jonas Salk, Thomas Edison"]
["FALSE",{"$f":"Data!C27","v":"Student26"},null,"","",{"$f":"IF(C33>=O8,B33,\"\")","v":""},", Carl Sagan*, **Marie Curie, Sigmund Freud, Stephen Hawking, Howard Gardner",{"$f":"IF(C33>=O9,IF(C33<O8,B33,\"\"),\"\")","v":""},"**Albert Einstein, Benjamin Franklin, John Dewey, **B.F. Skinner, Lev Vygotsky",{"$f":"IF(C33>=O10,IF(C33<O9,B33,\"\"),\"\")","v":""},", Henry Ford, Maria Montessori",{"$f":"IF(C33<O10,IF(C33=\"\",\"\",B33),\"\")","v":""},", Alfred Nobel, Charles Darwin, **Isaac Newton, Ivan Pavlov, Jane Goodall, Jean Piaget, **Jonas Salk, Thomas Edison"]
["FALSE",{"$f":"Data!C28","v":"Student27"},null,"","",{"$f":"IF(C34>=O8,B34,\"\")","v":""},", Carl Sagan*, **Marie Curie, Sigmund Freud, Stephen Hawking, Howard Gardner",{"$f":"IF(C34>=O9,IF(C34<O8,B34,\"\"),\"\")","v":""},"**Albert Einstein, Benjamin Franklin, John Dewey, **B.F. Skinner, Lev Vygotsky",{"$f":"IF(C34>=O10,IF(C34<O9,B34,\"\"),\"\")","v":""},", Henry Ford, Maria Montessori",{"$f":"IF(C34<O10,IF(C34=\"\",\"\",B34),\"\")","v":""},", Alfred Nobel, Charles Darwin, **Isaac Newton, Ivan Pavlov, Jane Goodall, Jean Piaget, **Jonas Salk, Thomas Edison"]
["FALSE",{"$f":"Data!C29","v":"Student28"},null,"","",{"$f":"IF(C35>=O8,B35,\"\")","v":""},", Carl Sagan*, **Marie Curie, Sigmund Freud, Stephen Hawking, Howard Gardner",{"$f":"IF(C35>=O9,IF(C35<O8,B35,\"\"),\"\")","v":""},"**Albert Einstein, Benjamin Franklin, John Dewey, **B.F. Skinner, Lev Vygotsky",{"$f":"IF(C35>=O10,IF(C35<O9,B35,\"\"),\"\")","v":""},", Henry Ford, Maria Montessori",{"$f":"IF(C35<O10,IF(C35=\"\",\"\",B35),\"\")","v":""},", Alfred Nobel, Charles Darwin, **Isaac Newton, Ivan Pavlov, Jane Goodall, Jean Piaget, **Jonas Salk, Thomas Edison"]
["FALSE",{"$f":"Data!C30","v":"Student29"},null,"","",{"$f":"IF(C36>=O8,B36,\"\")","v":""},", Carl Sagan*, **Marie Curie, Sigmund Freud, Stephen Hawking, Howard Gardner",{"$f":"IF(C36>=O9,IF(C36<O8,B36,\"\"),\"\")","v":""},"**Albert Einstein, Benjamin Franklin, John Dewey, **B.F. Skinner, Lev Vygotsky",{"$f":"IF(C36>=O10,IF(C36<O9,B36,\"\"),\"\")","v":""},", Henry Ford, Maria Montessori",{"$f":"IF(C36<O10,IF(C36=\"\",\"\",B36),\"\")","v":""},", Alfred Nobel, Charles Darwin, **Isaac Newton, Ivan Pavlov, Jane Goodall, Jean Piaget, **Jonas Salk, Thomas Edison"]
["FALSE",{"$f":"Data!C31","v":"Student30"},null,"","",{"$f":"IF(C37>=O8,B37,\"\")","v":""},", Carl Sagan*, **Marie Curie, Sigmund Freud, Stephen Hawking, Howard Gardner",{"$f":"IF(C37>=O9,IF(C37<O8,B37,\"\"),\"\")","v":""},"**Albert Einstein, Benjamin Franklin, John Dewey, **B.F. Skinner, Lev Vygotsky",{"$f":"IF(C37>=O10,IF(C37<O9,B37,\"\"),\"\")","v":""},", Henry Ford, Maria Montessori",{"$f":"IF(C37<O10,IF(C37=\"\",\"\",B37),\"\")","v":""},", Alfred Nobel, Charles Darwin, **Isaac Newton, Ivan Pavlov, Jane Goodall, Jean Piaget, **Jonas Salk, Thomas Edison"]
["FALSE"]
[null,"TOTAL",{"$f":"SUM(C8:C37)","v":66},{"$f":"SUM(D8:D37)","v":120},{"$f":"C39/D39","v":0.55000000000000004}]

{"sheet":"Teacher4Pretest","index":9,"n_rows":39,"n_cols":16,"rows_kept":39,"cut":false,"hidden":false,"merged":[[0,3,0,4],[0,1,0,2],[4,1,6,1],[4,3,5,3],[4,4,6,4],[1,1,1,2],[2,1,3,2],[1,3,1,4],[2,3,3,4],[4,2,6,2]]}
[null,{"$f":"IF(Data!N6=\"Other\",Data!N7,Data!N6)","v":"Grade 4"},null,{"$f":"Data!D1","v":"Smith"}]
[null,"Meeting Date:",null,{"$f":"Data!N8","v":"2/26/14"}]
[null,"Assessment:",null,{"$f":"Teacher1Pretest!D3","v":"Main Idea- R.I.4.2"}]
[]
[null,"Student Name","Points","Possible","Score - %"]
[]
[null,null,null,{"$f":"Teacher1Pretest!D7","v":6},null,"Proficient",null,"Close",null,"Far",null,"Intervention"]
[{"$f":"IF(ISBLANK(C8),\"FALSE\",IF(LEFT(B8,2)=\"**\",IF(C8>=$O$8,$O$8,IF(C8>=$O$9,$O$9,IF(C8>=$O$10,$O$10,$O$11)))))","v":false},{"$f":"Data!D2","v":"Michael Jordan"},4,{"$f":"IF(C8=\"\",\"\",$D$7)","v":6},{"$f":"IF(D8=\"\",\"\",C8/$D$7)","v":0.66666666666666663},{"$f":"IF(C8>=O8,B8,\"\")","v":""},{"$f":"F8","v":""},{"$f":"IF(C8>=O9,IF(C8<O8,B8,\"\"),\"\")","v":"Michael Jordan"},{"$f":"H8","v":"Michael Jordan"},{"$f":"IF(C8>=O10,IF(C8<O9,B8,\"\"),\"\")","v":""},{"$f":"J8","v":""},{"$f":"IF(C8<O10,IF(C8=\"\",\"\",B8),\"\")","v":""},{"$f":"L8","v":""},null,{"$f":"Teacher1Pretest!O8","v":5},"Proficient"]
[{"$f":"IF(ISBLANK(C9),\"FALSE\",IF(LEFT(B9,2)=\"**\",IF(C9>=$O$8,$O$8,IF(C9>=$O$9,$O$9,IF(C9>=$O$10,$O$10,$O$11)))))","v":false},{"$f":"Data!D3","v":"Muhammad Ali"},4,{"$f":"IF(C9=\"\",\"\",$D$7)","v":6},{"$f":"IF(D9=\"\",\"\",C9/$D$7)","v":0.66666666666666663},{"$f":"IF(C9>=O8,B9,\"\")","v":""},{"$f":"G8&IF(F9=\"\",\"\",\", \")&F9","v":""},{"$f":"IF(C9>=O9,IF(C9<O8,B9,\"\"),\"\")","v":"Muhammad Ali"},{"$f":"I8&IF(H9=\"\",\"\",\", \")&H9","v":"Michael Jordan, Muhammad Ali"},{"$f":"IF(C9>=O10,IF(C9<O9,B9,\"\"),\"\")","v":""},{"$f":"K8&IF(J9=\"\",\"\",\", \")&J9","v":""},{"$f":"IF(C9<O10,IF(C9=\"\",\"\",B9),\"\")","v":""},{"$f":"M8&IF(L9=\"\",\"\",\", \")&L9","v":""},null,{"$f":"Teacher1Pretest!O9","v":4},"Close to Proficient"]
[false,{"$f":"Data!D4","v":"Roger Federer"},1,6,0.16666666666666666,{"$f":"IF(C10>=O8,B10,\"\")","v":""},{"$f":"G9&IF(F10=\"\",\"\",\", \")&F10","v":""},{"$f":"IF(C10>=O9,IF(C10<O8,B10,\"\"),\"\")","v":""},{"$f":"I9&IF(H10=\"\",\"\",\", \")&H10","v":"Michael Jordan, Muhammad Ali"},{"$f":"IF(C10>=O10,IF(C10<O9,B10,\"\"),\"\")","v":""},{"$f":"K9&IF(J10=\"\",\"\",\", \")&J10","v":""},{"$f":"IF(C10<O10,IF(C10=\"\",\"\",B10),\"\")","v":"Roger Federer"},{"$f":"M9&IF(L10=\"\",\"\",\", \")&L10","v":", Roger Federer"},null,{"$f":"Teacher1Pretest!O10","v":3},"Far to Go But Likely to Become Proficient"]
[5,{"$f":"Data!D5","v":"**Michael Phelps"},5,6,0.83333333333333337,{"$f":"IF(C11>=O8,B11,\"\")","v":"**Michael Phelps"},", **Michael Phelps",{"$f":"IF(C11>=O9,IF(C11<O8,B11,\"\"),\"\")","v":""},"Michael Jordan, Muhammad Ali",{"$f":"IF(C11>=O10,IF(C11<O9,B11,\"\"),\"\")","v":""},"",{"$f":"IF(C11<O10,IF(C11=\"\",\"\",B11),\"\")","v":""},", Roger Federer",null,{"$f":"Teacher1Pretest!O11","v":1},"Intervention (Far to Go But Not Likely to Become Proficient)"]
[false,{"$f":"Data!D6","v":"Wayne Gretzky"},1,6,0.16666666666666666,{"$f":"IF(C12>=O8,B12,\"\")","v":""},", **Michael Phelps",{"$f":"IF(C12>=O9,IF(C12<O8,B12,\"\"),\"\")","v":""},"Michael Jordan, Muhammad Ali",{"$f":"IF(C12>=O10,IF(C12<O9,B12,\"\"),\"\")","v":""},"",{"$f":"IF(C12<O10,IF(C12=\"\",\"\",B12),\"\")","v":"Wayne Gretzky"},", Roger Federer, Wayne Gretzky"]
[1,{"$f":"Data!D7","v":"**Jim Thorpe"},2,6,0.33333333333333331,{"$f":"IF(C13>=O8,B13,\"\")","v":""},", **Michael Phelps",{"$f":"IF(C13>=O9,IF(C13<O8,B13,\"\"),\"\")","v":""},"Michael Jordan, Muhammad Ali",{"$f":"IF(C13>=O10,IF(C13<O9,B13,\"\"),\"\")","v":""},"",{"$f":"IF(C13<O10,IF(C13=\"\",\"\",B13),\"\")","v":"**Jim Thorpe"},", Roger Federer, Wayne Gretzky, **Jim Thorpe"]
[false,{"$f":"Data!D8","v":"Tiger Woods"},2,6,0.33333333333333331,{"$f":"IF(C14>=O8,B14,\"\")","v":""},", **Michael Phelps",{"$f":"IF(C14>=O9,IF(C14<O8,B14,\"\"),\"\")","v":""},"Michael Jordan, Muhammad Ali",{"$f":"IF(C14>=O10,IF(C14<O9,B14,\"\"),\"\")","v":""},"",{"$f":"IF(C14<O10,IF(C14=\"\",\"\",B14),\"\")","v":"Tiger Woods"},", Roger Federer, Wayne Gretzky, **Jim Thorpe, Tiger Woods"]
[false,{"$f":"Data!D9","v":"Serena Williams"},2,6,0.33333333333333331,{"$f":"IF(C15>=O8,B15,\"\")","v":""},", **Michael Phelps",{"$f":"IF(C15>=O9,IF(C15<O8,B15,\"\"),\"\")","v":""},"Michael Jordan, Muhammad Ali",{"$f":"IF(C15>=O10,IF(C15<O9,B15,\"\"),\"\")","v":""},"",{"$f":"IF(C15<O10,IF(C15=\"\",\"\",B15),\"\")","v":"Serena Williams"},", Roger Federer, Wayne Gretzky, **Jim Thorpe, Tiger Woods, Serena Williams"]
[1,{"$f":"Data!D10","v":"**Joe Montana"},1,6,0.16666666666666666,{"$f":"IF(C16>=O8,B16,\"\")","v":""},", **Michael Phelps",{"$f":"IF(C16>=O9,IF(C16<O8,B16,\"\"),\"\")","v":""},"Michael Jordan, Muhammad Ali",{"$f":"IF(C16>=O10,IF(C16<O9,B16,\"\"),\"\")","v":""},"",{"$f":"IF(C16<O10,IF(C16=\"\",\"\",B16),\"\")","v":"**Joe Montana"},", Roger Federer, Wayne Gretzky, **Jim Thorpe, Tiger Woods, Serena Williams, **Joe Montana"]
[false,{"$f":"Data!D11","v":"Jeff Gordon"},4,6,0.66666666666666663,{"$f":"IF(C17>=O8,B17,\"\")","v":""},", **Michael Phelps",{"$f":"IF(C17>=O9,IF(C17<O8,B17,\"\"),\"\")","v":"Jeff Gordon"},"Michael Jordan, Muhammad Ali, Jeff Gordon",{"$f":"IF(C17>=O10,IF(C17<O9,B17,\"\"),\"\")","v":""},"",{"$f":"IF(C17<O10,IF(C17=\"\",\"\",B17),\"\")","v":""},", Roger Federer, Wayne Gretzky, **Jim Thorpe, Tiger Woods, Serena Williams, **Joe Montana"]
[false,{"$f":"Data!D12","v":"Peyton Manning"},2,6,0.33333333333333331,{"$f":"IF(C18>=O8,B18,\"\")","v":""},", **Michael Phelps",{"$f":"IF(C18>=O9,IF(C18<O8,B18,\"\"),\"\")","v":""},"Michael Jordan, Muhammad Ali, Jeff Gordon",{"$f":"IF(C18>=O10,IF(C18<O9,B18,\"\"),\"\")","v":""},"",{"$f":"IF(C18<O10,IF(C18=\"\",\"\",B18),\"\")","v":"Peyton Manning"},", Roger Federer, Wayne Gretzky, **Jim Thorpe, Tiger Woods, Serena Williams, **Joe Montana, Peyton Manning"]
[false,{"$f":"Data!D13","v":"Shaun White"},5,6,0.83333333333333337,{"$f":"IF(C19>=O8,B19,\"\")","v":"Shaun White"},", **Michael Phelps, Shaun White",{"$f":"IF(C19>=O9,IF(C19<O8,B19,\"\"),\"\")","v":""},"Michael Jordan, Muhammad Ali, Jeff Gordon",{"$f":"IF(C19>=O10,IF(C19<O9,B19,\"\"),\"\")","v":""},"",{"$f":"IF(C19<O10,IF(C19=\"\",\"\",B19),\"\")","v":""},", Roger Federer, Wayne Gretzky, **Jim Thorpe, Tiger Woods, Serena Williams, **Joe Montana, Peyton Manning"]
[false,{"$f":"Data!D14","v":"Danica Patrick"},5,6,0.83333333333333337,{"$f":"IF(C20>=O8,B20,\"\")","v":"Danica Patrick"},", **Michael Phelps, Shaun White, Danica Patrick",{"$f":"IF(C20>=O9,IF(C20<O8,B20,\"\"),\"\")","v":""},"Michael Jordan, Muhammad Ali, Jeff Gordon",{"$f":"IF(C20>=O10,IF(C20<O9,B20,\"\"),\"\")","v":""},"",{"$f":"IF(C20<O10,IF(C20=\"\",\"\",B20),\"\")","v":""},", Roger Federer, Wayne Gretzky, **Jim Thorpe, Tiger Woods, Serena Williams, **Joe Montana, Peyton Manning"]
[3,{"$f":"Data!D15","v":"**Tony Hawk"},3,6,0.5,{"$f":"IF(C21>=O8,B21,\"\")","v":""},", **Michael Phelps, Shaun White, Danica Patrick",{"$f":"IF(C21>=O9,IF(C21<O8,B21,\"\"),\"\")","v":""},"Michael Jordan, Muhammad Ali, Jeff Gordon",{"$f":"IF(C21>=O10,IF(C21<O9,B21,\"\"),\"\")","v":"**Tony Hawk"},", **Tony Hawk",{"$f":"IF(C21<O10,IF(C21=\"\",\"\",B21),\"\")","v":""},", Roger Federer, Wayne Gretzky, **Jim Thorpe, Tiger Woods, Serena Williams, **Joe Montana, Peyton Manning"]
[false,{"$f":"Data!D16","v":"LeBron James"},5,6,0.83333333333333337,{"$f":"IF(C22>=O8,B22,\"\")","v":"LeBron James"},", **Michael Phelps, Shaun White, Danica Patrick, LeBron James",{"$f":"IF(C22>=O9,IF(C22<O8,B22,\"\"),\"\")","v":""},"Michael Jordan, Muhammad Ali, Jeff Gordon",{"$f":"IF(C22>=O10,IF(C22<O9,B22,\"\"),\"\")","v":""},", **Tony Hawk",{"$f":"IF(C22<O10,IF(C22=\"\",\"\",B22),\"\")","v":""},", Roger Federer, Wayne Gretzky, **Jim Thorpe, Tiger Woods, Serena Williams, **Joe Montana, Peyton Manning"]
[false,{"$f":"Data!D17","v":"Gordie Howe"},5,6,0.83333333333333337,{"$f":"IF(C23>=O8,B23,\"\")","v":"Gordie Howe"},", **Michael Phelps, Shaun White, Danica Patrick, LeBron James, Gordie Howe",{"$f":"IF(C23>=O9,IF(C23<O8,B23,\"\"),\"\")","v":""},"Michael Jordan, Muhammad Ali, Jeff Gordon",{"$f":"IF(C23>=O10,IF(C23<O9,B23,\"\"),\"\")","v":""},", **Tony Hawk",{"$f":"IF(C23<O10,IF(C23=\"\",\"\",B23),\"\")","v":""},", Roger Federer, Wayne Gretzky, **Jim Thorpe, Tiger Woods, Serena Williams, **Joe Montana, Peyton Manning"]
[3,{"$f":"Data!D18","v":"**George Forman"},3,6,0.5,{"$f":"IF(C24>=O8,B24,\"\")","v":""},", **Michael Phelps, Shaun White, Danica Patrick, LeBron James, Gordie Howe",{"$f":"IF(C24>=O9,IF(C24<O8,B24,\"\"),\"\")","v":""},"Michael Jordan, Muhammad Ali, Jeff Gordon",{"$f":"IF(C24>=O10,IF(C24<O9,B24,\"\"),\"\")","v":"**George Forman"},", **Tony Hawk, **George Forman",{"$f":"IF(C24<O10,IF(C24=\"\",\"\",B24),\"\")","v":""},", Roger Federer, Wayne Gretzky, **Jim Thorpe, Tiger Woods, Serena Williams, **Joe Montana, Peyton Manning"]
[false,{"$f":"Data!D19","v":"Martina Navratilova"},5,6,0.83333333333333337,{"$f":"IF(C25>=O8,B25,\"\")","v":"Martina Navratilova"},", **Michael Phelps, Shaun White, Danica Patrick, LeBron James, Gordie Howe, Martina Navratilova",{"$f":"IF(C25>=O9,IF(C25<O8,B25,\"\"),\"\")","v":""},"Michael Jordan, Muhammad Ali, Jeff Gordon",{"$f":"IF(C25>=O10,IF(C25<O9,B25,\"\"),\"\")","v":""},", **Tony Hawk, **George Forman",{"$f":"IF(C25<O10,IF(C25=\"\",\"\",B25),\"\")","v":""},", Roger Federer, Wayne Gretzky, **Jim Thorpe, Tiger Woods, Serena Williams, **Joe Montana, Peyton Manning"]
[false,{"$f":"Data!D20","v":"Yadier Molina"},6,6,1,{"$f":"IF(C26>=O8,B26,\"\")","v":"Yadier Molina"},", **Michael Phelps, Shaun White, Danica Patrick, LeBron James, Gordie Howe, Martina Navratilova, Yadier Molina",{"$f":"IF(C26>=O9,IF(C26<O8,B26,\"\"),\"\")","v":""},"Michael Jordan, Muhammad Ali, Jeff Gordon",{"$f":"IF(C26>=O10,IF(C26<O9,B26,\"\"),\"\")","v":""},", **Tony Hawk, **George Forman",{"$f":"IF(C26<O10,IF(C26=\"\",\"\",B26),\"\")","v":""},", Roger Federer, Wayne Gretzky, **Jim Thorpe, Tiger Woods, Serena Williams, **Joe Montana, Peyton Manning"]
["FALSE",{"$f":"Data!D21","v":"Student20"},null,"","",{"$f":"IF(C27>=O8,B27,\"\")","v":""},", **Michael Phelps, Shaun White, Danica Patrick, LeBron James, Gordie Howe, Martina Navratilova, Yadier Molina",{"$f":"IF(C27>=O9,IF(C27<O8,B27,\"\"),\"\")","v":""},"Michael Jordan, Muhammad Ali, Jeff Gordon",{"$f":"IF(C27>=O10,IF(C27<O9,B27,\"\"),\"\")","v":""},", **Tony Hawk, **George Forman",{"$f":"IF(C27<O10,IF(C27=\"\",\"\",B27),\"\")","v":""},", Roger Federer, Wayne Gretzky, **Jim Thorpe, Tiger Woods, Serena Williams, **Joe Montana, Peyton Manning"]
["FALSE",{"$f":"Data!D22","v":"Student21"},null,"","",{"$f":"IF(C28>=O8,B28,\"\")","v":""},", **Michael Phelps, Shaun White, Danica Patrick, LeBron James, Gordie Howe, Martina Navratilova, Yadier Molina",{"$f":"IF(C28>=O9,IF(C28<O8,B28,\"\"),\"\")","v":""},"Michael Jordan, Muhammad Ali, Jeff Gordon",{"$f":"IF(C28>=O10,IF(C28<O9,B28,\"\"),\"\")","v":""},", **Tony Hawk, **George Forman",{"$f":"IF(C28<O10,IF(C28=\"\",\"\",B28),\"\")","v":""},", Roger Federer, Wayne Gretzky, **Jim Thorpe, Tiger Woods, Serena Williams, **Joe Montana, Peyton Manning"]
["FALSE",{"$f":"Data!D23","v":"Student22"},null,"","",{"$f":"IF(C29>=O8,B29,\"\")","v":""},", **Michael Phelps, Shaun White, Danica Patrick, LeBron James, Gordie Howe, Martina Navratilova, Yadier Molina",{"$f":"IF(C29>=O9,IF(C29<O8,B29,\"\"),\"\")","v":""},"Michael Jordan, Muhammad Ali, Jeff Gordon",{"$f":"IF(C29>=O10,IF(C29<O9,B29,\"\"),\"\")","v":""},", **Tony Hawk, **George Forman",{"$f":"IF(C29<O10,IF(C29=\"\",\"\",B29),\"\")","v":""},", Roger Federer, Wayne Gretzky, **Jim Thorpe, Tiger Woods, Serena Williams, **Joe Montana, Peyton Manning"]
["FALSE",{"$f":"Data!D24","v":"Student23"},null,"","",{"$f":"IF(C30>=O8,B30,\"\")","v":""},", **Michael Phelps, Shaun White, Danica Patrick, LeBron James, Gordie Howe, Martina Navratilova, Yadier Molina",{"$f":"IF(C30>=O9,IF(C30<O8,B30,\"\"),\"\")","v":""},"Michael Jordan, Muhammad Ali, Jeff Gordon",{"$f":"IF(C30>=O10,IF(C30<O9,B30,\"\"),\"\")","v":""},", **Tony Hawk, **George Forman",{"$f":"IF(C30<O10,IF(C30=\"\",\"\",B30),\"\")","v":""},", Roger Federer, Wayne Gretzky, **Jim Thorpe, Tiger Woods, Serena Williams, **Joe Montana, Peyton Manning"]
["FALSE",{"$f":"Data!D25","v":"Student24"},null,"","",{"$f":"IF(C31>=O8,B31,\"\")","v":""},", **Michael Phelps, Shaun White, Danica Patrick, LeBron James, Gordie Howe, Martina Navratilova, Yadier Molina",{"$f":"IF(C31>=O9,IF(C31<O8,B31,\"\"),\"\")","v":""},"Michael Jordan, Muhammad Ali, Jeff Gordon",{"$f":"IF(C31>=O10,IF(C31<O9,B31,\"\"),\"\")","v":""},", **Tony Hawk, **George Forman",{"$f":"IF(C31<O10,IF(C31=\"\",\"\",B31),\"\")","v":""},", Roger Federer, Wayne Gretzky, **Jim Thorpe, Tiger Woods, Serena Williams, **Joe Montana, Peyton Manning"]
["FALSE",{"$f":"Data!D26","v":"Student25"},null,"","",{"$f":"IF(C32>=O8,B32,\"\")","v":""},", **Michael Phelps, Shaun White, Danica Patrick, LeBron James, Gordie Howe, Martina Navratilova, Yadier Molina",{"$f":"IF(C32>=O9,IF(C32<O8,B32,\"\"),\"\")","v":""},"Michael Jordan, Muhammad Ali, Jeff Gordon",{"$f":"IF(C32>=O10,IF(C32<O9,B32,\"\"),\"\")","v":""},", **Tony Hawk, **George Forman",{"$f":"IF(C32<O10,IF(C32=\"\",\"\",B32),\"\")","v":""},", Roger Federer, Wayne Gretzky, **Jim Thorpe, Tiger Woods, Serena Williams, **Joe Montana, Peyton Manning"]
["FALSE",{"$f":"Data!D27","v":"Student26"},null,"","",{"$f":"IF(C33>=O8,B33,\"\")","v":""},", **Michael Phelps, Shaun White, Danica Patrick, LeBron James, Gordie Howe, Martina Navratilova, Yadier Molina",{"$f":"IF(C33>=O9,IF(C33<O8,B33,\"\"),\"\")","v":""},"Michael Jordan, Muhammad Ali, Jeff Gordon",{"$f":"IF(C33>=O10,IF(C33<O9,B33,\"\"),\"\")","v":""},", **Tony Hawk, **George Forman",{"$f":"IF(C33<O10,IF(C33=\"\",\"\",B33),\"\")","v":""},", Roger Federer, Wayne Gretzky, **Jim Thorpe, Tiger Woods, Serena Williams, **Joe Montana, Peyton Manning"]
["FALSE",{"$f":"Data!D28","v":"Student27"},null,"","",{"$f":"IF(C34>=O8,B34,\"\")","v":""},", **Michael Phelps, Shaun White, Danica Patrick, LeBron James, Gordie Howe, Martina Navratilova, Yadier Molina",{"$f":"IF(C34>=O9,IF(C34<O8,B34,\"\"),\"\")","v":""},"Michael Jordan, Muhammad Ali, Jeff Gordon",{"$f":"IF(C34>=O10,IF(C34<O9,B34,\"\"),\"\")","v":""},", **Tony Hawk, **George Forman",{"$f":"IF(C34<O10,IF(C34=\"\",\"\",B34),\"\")","v":""},", Roger Federer, Wayne Gretzky, **Jim Thorpe, Tiger Woods, Serena Williams, **Joe Montana, Peyton Manning"]
["FALSE",{"$f":"Data!D29","v":"Student28"},null,"","",{"$f":"IF(C35>=O8,B35,\"\")","v":""},", **Michael Phelps, Shaun White, Danica Patrick, LeBron James, Gordie Howe, Martina Navratilova, Yadier Molina",{"$f":"IF(C35>=O9,IF(C35<O8,B35,\"\"),\"\")","v":""},"Michael Jordan, Muhammad Ali, Jeff Gordon",{"$f":"IF(C35>=O10,IF(C35<O9,B35,\"\"),\"\")","v":""},", **Tony Hawk, **George Forman",{"$f":"IF(C35<O10,IF(C35=\"\",\"\",B35),\"\")","v":""},", Roger Federer, Wayne Gretzky, **Jim Thorpe, Tiger Woods, Serena Williams, **Joe Montana, Peyton Manning"]
["FALSE",{"$f":"Data!D30","v":"Student29"},null,"","",{"$f":"IF(C36>=O8,B36,\"\")","v":""},", **Michael Phelps, Shaun White, Danica Patrick, LeBron James, Gordie Howe, Martina Navratilova, Yadier Molina",{"$f":"IF(C36>=O9,IF(C36<O8,B36,\"\"),\"\")","v":""},"Michael Jordan, Muhammad Ali, Jeff Gordon",{"$f":"IF(C36>=O10,IF(C36<O9,B36,\"\"),\"\")","v":""},", **Tony Hawk, **George Forman",{"$f":"IF(C36<O10,IF(C36=\"\",\"\",B36),\"\")","v":""},", Roger Federer, Wayne Gretzky, **Jim Thorpe, Tiger Woods, Serena Williams, **Joe Montana, Peyton Manning"]
["FALSE",{"$f":"Data!D31","v":"Student30"},null,"","",{"$f":"IF(C37>=O8,B37,\"\")","v":""},", **Michael Phelps, Shaun White, Danica Patrick, LeBron James, Gordie Howe, Martina Navratilova, Yadier Molina",{"$f":"IF(C37>=O9,IF(C37<O8,B37,\"\"),\"\")","v":""},"Michael Jordan, Muhammad Ali, Jeff Gordon",{"$f":"IF(C37>=O10,IF(C37<O9,B37,\"\"),\"\")","v":""},", **Tony Hawk, **George Forman",{"$f":"IF(C37<O10,IF(C37=\"\",\"\",B37),\"\")","v":""},", Roger Federer, Wayne Gretzky, **Jim Thorpe, Tiger Woods, Serena Williams, **Joe Montana, Peyton Manning"]
["FALSE"]
[null,"TOTAL",{"$f":"SUM(C8:C37)","v":65},{"$f":"SUM(D8:D37)","v":114},{"$f":"C39/D39","v":0.57017543859649122}]

{"sheet":"Do Not Use","index":10,"n_rows":39,"n_cols":15,"rows_kept":39,"cut":false,"hidden":true,"merged":[[0,2,0,3],[0,0,0,1],[4,0,6,0],[4,2,5,2],[4,3,6,3],[1,0,1,1],[2,0,3,1],[1,2,1,3],[2,2,3,3],[4,1,6,1]]}
[{"$f":"IF(Data!N6=\"Other\",Data!N7,Data!N6)","v":"Grade 4"},null,{"$f":"Data!E1","v":"Do Not Use"}]
["Meeting Date:",null,{"$f":"Data!N8","v":"2/26/14"}]
["Assessment:",null,{"$f":"Teacher1Pretest!D3","v":"Main Idea- R.I.4.2"}]
[]
["Student Name","Points","Possible","Score - %"]
[]
[null,null,{"$f":"Teacher1Pretest!D7","v":6},null,"Proficient",null,"Close",null,"Far",null,"Intervention"]
[{"$f":"Data!E2","v":"Do Not Use"},null,null,{"$f":"B8/C8","v":{"$error":"#DIV/0!"}},{"$f":"IF(B8>=N8,A8,\"\")","v":""},{"$f":"E8","v":""},{"$f":"IF(B8>=N9,IF(B8<N8,A8,\"\"),\"\")","v":""},{"$f":"G8","v":""},{"$f":"IF(B8>=N10,IF(B8<N9,A8,\"\"),\"\")","v":""},{"$f":"I8","v":""},{"$f":"IF(B8<N10,IF(B8=\"\",\"\",A8),\"\")","v":""},{"$f":"K8","v":""},null,{"$f":"Teacher1Pretest!O8","v":5},"Proficient"]
[{"$f":"Data!E3","v":"Do Not Use"},null,{"$f":"IF(B9=\"\",\"NULL\",C7)","v":"NULL"},{"$f":"B9/C9","v":{"$error":"#VALUE!"}},{"$f":"IF(B9>=N8,A9,\"\")","v":""},{"$f":"F8&IF(E9=\"\",\"\",\", \")&E9","v":""},{"$f":"IF(B9>=N9,IF(B9<N8,A9,\"\"),\"\")","v":""},{"$f":"H8&IF(G9=\"\",\"\",\", \")&G9","v":""},{"$f":"IF(B9>=N10,IF(B9<N9,A9,\"\"),\"\")","v":""},{"$f":"J8&IF(I9=\"\",\"\",\", \")&I9","v":""},{"$f":"IF(B9<N10,IF(B9=\"\",\"\",A9),\"\")","v":""},{"$f":"L8&IF(K9=\"\",\"\",\", \")&K9","v":""},null,{"$f":"Teacher1Pretest!O9","v":4},"Close to Proficient"]
[{"$f":"Data!E4","v":"Do Not Use"},null,{"$f":"IF(B10=\"\",\"NULL\",C7)","v":"NULL"},{"$error":"#VALUE!"},{"$f":"IF(B10>=N8,A10,\"\")","v":""},{"$f":"F9&IF(E10=\"\",\"\",\", \")&E10","v":""},{"$f":"IF(B10>=N9,IF(B10<N8,A10,\"\"),\"\")","v":""},{"$f":"H9&IF(G10=\"\",\"\",\", \")&G10","v":""},{"$f":"IF(B10>=N10,IF(B10<N9,A10,\"\"),\"\")","v":""},{"$f":"J9&IF(I10=\"\",\"\",\", \")&I10","v":""},{"$f":"IF(B10<N10,IF(B10=\"\",\"\",A10),\"\")","v":""},{"$f":"L9&IF(K10=\"\",\"\",\", \")&K10","v":""},null,{"$f":"Teacher1Pretest!O10","v":3},"Far to Go But Likely to Become Proficient"]
[{"$f":"Data!E5","v":"Do Not Use"},null,{"$f":"IF(B11=\"\",\"NULL\",C7)","v":"NULL"},{"$error":"#VALUE!"},{"$f":"IF(B11>=N8,A11,\"\")","v":""},"",{"$f":"IF(B11>=N9,IF(B11<N8,A11,\"\"),\"\")","v":""},"",{"$f":"IF(B11>=N10,IF(B11<N9,A11,\"\"),\"\")","v":""},"",{"$f":"IF(B11<N10,IF(B11=\"\",\"\",A11),\"\")","v":""},"",null,{"$f":"Teacher1Pretest!O11","v":1},"Intervention (Far to Go But Not Likely to Become Proficient)"]
[{"$f":"Data!E6","v":"Do Not Use"},null,{"$f":"IF(B12=\"\",\"NULL\",C7)","v":"NULL"},{"$error":"#VALUE!"},{"$f":"IF(B12>=N8,A12,\"\")","v":""},"",{"$f":"IF(B12>=N9,IF(B12<N8,A12,\"\"),\"\")","v":""},"",{"$f":"IF(B12>=N10,IF(B12<N9,A12,\"\"),\"\")","v":""},"",{"$f":"IF(B12<N10,IF(B12=\"\",\"\",A12),\"\")","v":""},""]
[{"$f":"Data!E7","v":"Do Not Use"},null,{"$f":"IF(B13=\"\",\"NULL\",C7)","v":"NULL"},{"$error":"#VALUE!"},{"$f":"IF(B13>=N8,A13,\"\")","v":""},"",{"$f":"IF(B13>=N9,IF(B13<N8,A13,\"\"),\"\")","v":""},"",{"$f":"IF(B13>=N10,IF(B13<N9,A13,\"\"),\"\")","v":""},"",{"$f":"IF(B13<N10,IF(B13=\"\",\"\",A13),\"\")","v":""},""]
[{"$f":"Data!E8","v":"Do Not Use"},null,{"$f":"IF(B14=\"\",\"NULL\",C7)","v":"NULL"},{"$error":"#VALUE!"},{"$f":"IF(B14>=N8,A14,\"\")","v":""},"",{"$f":"IF(B14>=N9,IF(B14<N8,A14,\"\"),\"\")","v":""},"",{"$f":"IF(B14>=N10,IF(B14<N9,A14,\"\"),\"\")","v":""},"",{"$f":"IF(B14<N10,IF(B14=\"\",\"\",A14),\"\")","v":""},""]
[{"$f":"Data!E9","v":"Do Not Use"},null,{"$f":"IF(B15=\"\",\"NULL\",C7)","v":"NULL"},{"$error":"#VALUE!"},{"$f":"IF(B15>=N8,A15,\"\")","v":""},"",{"$f":"IF(B15>=N9,IF(B15<N8,A15,\"\"),\"\")","v":""},"",{"$f":"IF(B15>=N10,IF(B15<N9,A15,\"\"),\"\")","v":""},"",{"$f":"IF(B15<N10,IF(B15=\"\",\"\",A15),\"\")","v":""},""]
[{"$f":"Data!E10","v":"Do Not Use"},null,{"$f":"IF(B16=\"\",\"NULL\",C7)","v":"NULL"},{"$error":"#VALUE!"},{"$f":"IF(B16>=N8,A16,\"\")","v":""},"",{"$f":"IF(B16>=N9,IF(B16<N8,A16,\"\"),\"\")","v":""},"",{"$f":"IF(B16>=N10,IF(B16<N9,A16,\"\"),\"\")","v":""},"",{"$f":"IF(B16<N10,IF(B16=\"\",\"\",A16),\"\")","v":""},""]
[{"$f":"Data!E11","v":"Do Not Use"},null,{"$f":"IF(B17=\"\",\"NULL\",C7)","v":"NULL"},{"$error":"#VALUE!"},{"$f":"IF(B17>=N8,A17,\"\")","v":""},"",{"$f":"IF(B17>=N9,IF(B17<N8,A17,\"\"),\"\")","v":""},"",{"$f":"IF(B17>=N10,IF(B17<N9,A17,\"\"),\"\")","v":""},"",{"$f":"IF(B17<N10,IF(B17=\"\",\"\",A17),\"\")","v":""},""]
[{"$f":"Data!E12","v":"Do Not Use"},null,{"$f":"IF(B18=\"\",\"NULL\",C7)","v":"NULL"},{"$error":"#VALUE!"},{"$f":"IF(B18>=N8,A18,\"\")","v":""},"",{"$f":"IF(B18>=N9,IF(B18<N8,A18,\"\"),\"\")","v":""},"",{"$f":"IF(B18>=N10,IF(B18<N9,A18,\"\"),\"\")","v":""},"",{"$f":"IF(B18<N10,IF(B18=\"\",\"\",A18),\"\")","v":""},""]
[{"$f":"Data!E13","v":"Do Not Use"},null,{"$f":"IF(B19=\"\",\"NULL\",C7)","v":"NULL"},{"$error":"#VALUE!"},{"$f":"IF(B19>=N8,A19,\"\")","v":""},"",{"$f":"IF(B19>=N9,IF(B19<N8,A19,\"\"),\"\")","v":""},"",{"$f":"IF(B19>=N10,IF(B19<N9,A19,\"\"),\"\")","v":""},"",{"$f":"IF(B19<N10,IF(B19=\"\",\"\",A19),\"\")","v":""},""]
[{"$f":"Data!E14","v":"Do Not Use"},null,{"$f":"IF(B20=\"\",\"NULL\",C7)","v":"NULL"},{"$error":"#VALUE!"},{"$f":"IF(B20>=N8,A20,\"\")","v":""},"",{"$f":"IF(B20>=N9,IF(B20<N8,A20,\"\"),\"\")","v":""},"",{"$f":"IF(B20>=N10,IF(B20<N9,A20,\"\"),\"\")","v":""},"",{"$f":"IF(B20<N10,IF(B20=\"\",\"\",A20),\"\")","v":""},""]
[{"$f":"Data!E15","v":"Do Not Use"},null,{"$f":"IF(B21=\"\",\"NULL\",C7)","v":"NULL"},{"$error":"#VALUE!"},{"$f":"IF(B21>=N8,A21,\"\")","v":""},"",{"$f":"IF(B21>=N9,IF(B21<N8,A21,\"\"),\"\")","v":""},"",{"$f":"IF(B21>=N10,IF(B21<N9,A21,\"\"),\"\")","v":""},"",{"$f":"IF(B21<N10,IF(B21=\"\",\"\",A21),\"\")","v":""},""]
[{"$f":"Data!E16","v":"Do Not Use"},null,{"$f":"IF(B22=\"\",\"NULL\",C7)","v":"NULL"},{"$error":"#VALUE!"},{"$f":"IF(B22>=N8,A22,\"\")","v":""},"",{"$f":"IF(B22>=N9,IF(B22<N8,A22,\"\"),\"\")","v":""},"",{"$f":"IF(B22>=N10,IF(B22<N9,A22,\"\"),\"\")","v":""},"",{"$f":"IF(B22<N10,IF(B22=\"\",\"\",A22),\"\")","v":""},""]
[{"$f":"Data!E17","v":"Do Not Use"},null,{"$f":"IF(B23=\"\",\"NULL\",C7)","v":"NULL"},{"$error":"#VALUE!"},{"$f":"IF(B23>=N8,A23,\"\")","v":""},"",{"$f":"IF(B23>=N9,IF(B23<N8,A23,\"\"),\"\")","v":""},"",{"$f":"IF(B23>=N10,IF(B23<N9,A23,\"\"),\"\")","v":""},"",{"$f":"IF(B23<N10,IF(B23=\"\",\"\",A23),\"\")","v":""},""]
[{"$f":"Data!E18","v":"Do Not Use"},null,{"$f":"IF(B24=\"\",\"NULL\",C7)","v":"NULL"},{"$error":"#VALUE!"},{"$f":"IF(B24>=N8,A24,\"\")","v":""},"",{"$f":"IF(B24>=N9,IF(B24<N8,A24,\"\"),\"\")","v":""},"",{"$f":"IF(B24>=N10,IF(B24<N9,A24,\"\"),\"\")","v":""},"",{"$f":"IF(B24<N10,IF(B24=\"\",\"\",A24),\"\")","v":""},""]
[{"$f":"Data!E19","v":"Do Not Use"},null,{"$f":"IF(B25=\"\",\"NULL\",C7)","v":"NULL"},{"$error":"#VALUE!"},{"$f":"IF(B25>=N8,A25,\"\")","v":""},"",{"$f":"IF(B25>=N9,IF(B25<N8,A25,\"\"),\"\")","v":""},"",{"$f":"IF(B25>=N10,IF(B25<N9,A25,\"\"),\"\")","v":""},"",{"$f":"IF(B25<N10,IF(B25=\"\",\"\",A25),\"\")","v":""},""]
[{"$f":"Data!E20","v":"Do Not Use"},null,{"$f":"IF(B26=\"\",\"NULL\",C7)","v":"NULL"},{"$error":"#VALUE!"},{"$f":"IF(B26>=N8,A26,\"\")","v":""},"",{"$f":"IF(B26>=N9,IF(B26<N8,A26,\"\"),\"\")","v":""},"",{"$f":"IF(B26>=N10,IF(B26<N9,A26,\"\"),\"\")","v":""},"",{"$f":"IF(B26<N10,IF(B26=\"\",\"\",A26),\"\")","v":""},""]
[{"$f":"Data!E21","v":"Do Not Use"},null,{"$f":"IF(B27=\"\",\"NULL\",C7)","v":"NULL"},{"$error":"#VALUE!"},{"$f":"IF(B27>=N8,A27,\"\")","v":""},"",{"$f":"IF(B27>=N9,IF(B27<N8,A27,\"\"),\"\")","v":""},"",{"$f":"IF(B27>=N10,IF(B27<N9,A27,\"\"),\"\")","v":""},"",{"$f":"IF(B27<N10,IF(B27=\"\",\"\",A27),\"\")","v":""},""]
[{"$f":"Data!E22","v":"Do Not Use"},null,{"$f":"IF(B28=\"\",\"NULL\",C7)","v":"NULL"},{"$error":"#VALUE!"},{"$f":"IF(B28>=N8,A28,\"\")","v":""},"",{"$f":"IF(B28>=N9,IF(B28<N8,A28,\"\"),\"\")","v":""},"",{"$f":"IF(B28>=N10,IF(B28<N9,A28,\"\"),\"\")","v":""},"",{"$f":"IF(B28<N10,IF(B28=\"\",\"\",A28),\"\")","v":""},""]
[{"$f":"Data!E23","v":"Do Not Use"},null,{"$f":"IF(B29=\"\",\"NULL\",C7)","v":"NULL"},{"$error":"#VALUE!"},{"$f":"IF(B29>=N8,A29,\"\")","v":""},"",{"$f":"IF(B29>=N9,IF(B29<N8,A29,\"\"),\"\")","v":""},"",{"$f":"IF(B29>=N10,IF(B29<N9,A29,\"\"),\"\")","v":""},"",{"$f":"IF(B29<N10,IF(B29=\"\",\"\",A29),\"\")","v":""},""]
[{"$f":"Data!E24","v":"Do Not Use"},null,{"$f":"IF(B30=\"\",\"NULL\",C7)","v":"NULL"},{"$error":"#VALUE!"},{"$f":"IF(B30>=N8,A30,\"\")","v":""},"",{"$f":"IF(B30>=N9,IF(B30<N8,A30,\"\"),\"\")","v":""},"",{"$f":"IF(B30>=N10,IF(B30<N9,A30,\"\"),\"\")","v":""},"",{"$f":"IF(B30<N10,IF(B30=\"\",\"\",A30),\"\")","v":""},""]
[{"$f":"Data!E25","v":"Do Not Use"},null,{"$f":"IF(B31=\"\",\"NULL\",C7)","v":"NULL"},{"$error":"#VALUE!"},{"$f":"IF(B31>=N8,A31,\"\")","v":""},"",{"$f":"IF(B31>=N9,IF(B31<N8,A31,\"\"),\"\")","v":""},"",{"$f":"IF(B31>=N10,IF(B31<N9,A31,\"\"),\"\")","v":""},"",{"$f":"IF(B31<N10,IF(B31=\"\",\"\",A31),\"\")","v":""},""]
[{"$f":"Data!E26","v":"Do Not Use"},null,{"$f":"IF(B32=\"\",\"NULL\",C7)","v":"NULL"},{"$error":"#VALUE!"},{"$f":"IF(B32>=N8,A32,\"\")","v":""},"",{"$f":"IF(B32>=N9,IF(B32<N8,A32,\"\"),\"\")","v":""},"",{"$f":"IF(B32>=N10,IF(B32<N9,A32,\"\"),\"\")","v":""},"",{"$f":"IF(B32<N10,IF(B32=\"\",\"\",A32),\"\")","v":""},""]
[{"$f":"Data!E27","v":"Do Not Use"},null,{"$f":"IF(B33=\"\",\"NULL\",C7)","v":"NULL"},{"$error":"#VALUE!"},{"$f":"IF(B33>=N8,A33,\"\")","v":""},"",{"$f":"IF(B33>=N9,IF(B33<N8,A33,\"\"),\"\")","v":""},"",{"$f":"IF(B33>=N10,IF(B33<N9,A33,\"\"),\"\")","v":""},"",{"$f":"IF(B33<N10,IF(B33=\"\",\"\",A33),\"\")","v":""},""]
[{"$f":"Data!E28","v":"Do Not Use"},null,{"$f":"IF(B34=\"\",\"NULL\",C7)","v":"NULL"},{"$error":"#VALUE!"},{"$f":"IF(B34>=N8,A34,\"\")","v":""},"",{"$f":"IF(B34>=N9,IF(B34<N8,A34,\"\"),\"\")","v":""},"",{"$f":"IF(B34>=N10,IF(B34<N9,A34,\"\"),\"\")","v":""},"",{"$f":"IF(B34<N10,IF(B34=\"\",\"\",A34),\"\")","v":""},""]
[{"$f":"Data!E29","v":"Do Not Use"},null,{"$f":"IF(B35=\"\",\"NULL\",C7)","v":"NULL"},{"$error":"#VALUE!"},{"$f":"IF(B35>=N8,A35,\"\")","v":""},"",{"$f":"IF(B35>=N9,IF(B35<N8,A35,\"\"),\"\")","v":""},"",{"$f":"IF(B35>=N10,IF(B35<N9,A35,\"\"),\"\")","v":""},"",{"$f":"IF(B35<N10,IF(B35=\"\",\"\",A35),\"\")","v":""},""]
[{"$f":"Data!E30","v":"Do Not Use"},null,{"$f":"IF(B36=\"\",\"NULL\",C7)","v":"NULL"},{"$error":"#VALUE!"},{"$f":"IF(B36>=N8,A36,\"\")","v":""},"",{"$f":"IF(B36>=N9,IF(B36<N8,A36,\"\"),\"\")","v":""},"",{"$f":"IF(B36>=N10,IF(B36<N9,A36,\"\"),\"\")","v":""},"",{"$f":"IF(B36<N10,IF(B36=\"\",\"\",A36),\"\")","v":""},""]
[{"$f":"Data!E31","v":"Do Not Use"},null,{"$f":"IF(B37=\"\",\"NULL\",C7)","v":"NULL"},{"$error":"#VALUE!"},{"$f":"IF(B37>=N8,A37,\"\")","v":""},"",{"$f":"IF(B37>=N9,IF(B37<N8,A37,\"\"),\"\")","v":""},"",{"$f":"IF(B37>=N10,IF(B37<N9,A37,\"\"),\"\")","v":""},"",{"$f":"IF(B37<N10,IF(B37=\"\",\"\",A37),\"\")","v":""},""]
[]
["TOTAL",{"$f":"SUM(B8:B37)","v":0},{"$f":"SUM(C8:C37)","v":0},{"$f":"B39/C39","v":{"$error":"#DIV/0!"}}]

{"sheet":"Teacher5Pretest","index":11,"n_rows":39,"n_cols":16,"rows_kept":39,"cut":false,"hidden":false,"merged":[[4,1,6,1],[4,2,6,2],[4,3,5,3],[4,4,6,4],[0,1,0,2],[0,3,0,4],[1,1,1,2],[1,3,1,4],[2,1,3,2],[2,3,3,4]]}
[null,{"$f":"IF(Data!N6=\"Other\",Data!N7,Data!N6)","v":"Grade 4"},null,{"$f":"Data!F1","v":"Milburn"}]
[null,"Meeting Date:",null,{"$f":"Data!N8","v":"2/26/14"}]
[null,"Assessment:",null,{"$f":"Teacher1Pretest!D3","v":"Main Idea- R.I.4.2"}]
[]
[null,"Student Name","Points","Possible","Score - %"]
[]
[null,null,null,{"$f":"Teacher1Pretest!D7","v":6},null,"Proficient",null,"Close",null,"Far",null,"Intervention"]
[{"$f":"IF(ISBLANK(C8),\"FALSE\",IF(LEFT(B8,2)=\"**\",IF(C8>=$O$8,$O$8,IF(C8>=$O$9,$O$9,IF(C8>=$O$10,$O$10,$O$11)))))","v":false},{"$f":"Data!F2","v":"Dave Sanders"},3,{"$f":"IF(C8=\"\",\"\",$D$7)","v":6},{"$f":"IF(D8=\"\",\"\",C8/$D$7)","v":0.5},{"$f":"IF(C8>=O8,B8,\"\")","v":""},{"$f":"F8","v":""},{"$f":"IF(C8>=O9,IF(C8<O8,B8,\"\"),\"\")","v":""},{"$f":"H8","v":""},{"$f":"IF(C8>=O10,IF(C8<O9,B8,\"\"),\"\")","v":"Dave Sanders"},{"$f":"J8","v":"Dave Sanders"},{"$f":"IF(C8<O10,IF(C8=\"\",\"\",B8),\"\")","v":""},{"$f":"L8","v":""},null,{"$f":"Teacher1Pretest!O8","v":5},"Proficient"]
[{"$f":"IF(ISBLANK(C9),\"FALSE\",IF(LEFT(B9,2)=\"**\",IF(C9>=$O$8,$O$8,IF(C9>=$O$9,$O$9,IF(C9>=$O$10,$O$10,$O$11)))))","v":false},{"$f":"Data!F3","v":"Carolyn Neal"},3,{"$f":"IF(C9=\"\",\"\",$D$7)","v":6},{"$f":"IF(D9=\"\",\"\",C9/$D$7)","v":0.5},{"$f":"IF(C9>=O8,B9,\"\")","v":""},{"$f":"G8&IF(F9=\"\",\"\",\", \")&F9","v":""},{"$f":"IF(C9>=O9,IF(C9<O8,B9,\"\"),\"\")","v":""},{"$f":"I8&IF(H9=\"\",\"\",\", \")&H9","v":""},{"$f":"IF(C9>=O10,IF(C9<O9,B9,\"\"),\"\")","v":"Carolyn Neal"},{"$f":"K8&IF(J9=\"\",\"\",\", \")&J9","v":"Dave Sanders, Carolyn Neal"},{"$f":"IF(C9<O10,IF(C9=\"\",\"\",B9),\"\")","v":""},{"$f":"M8&IF(L9=\"\",\"\",\", \")&L9","v":""},null,{"$f":"Teacher1Pretest!O9","v":4},"Close to Proficient"]
[false,{"$f":"Data!F4","v":"Bertha Richardson"},4,6,0.66666666666666663,{"$f":"IF(C10>=O8,B10,\"\")","v":""},{"$f":"G9&IF(F10=\"\",\"\",\", \")&F10","v":""},{"$f":"IF(C10>=O9,IF(C10<O8,B10,\"\"),\"\")","v":"Bertha Richardson"},{"$f":"I9&IF(H10=\"\",\"\",\", \")&H10","v":", Bertha Richardson"},{"$f":"IF(C10>=O10,IF(C10<O9,B10,\"\"),\"\")","v":""},{"$f":"K9&IF(J10=\"\",\"\",\", \")&J10","v":"Dave Sanders, Carolyn Neal"},{"$f":"IF(C10<O10,IF(C10=\"\",\"\",B10),\"\")","v":""},{"$f":"M9&IF(L10=\"\",\"\",\", \")&L10","v":""},null,{"$f":"Teacher1Pretest!O10","v":3},"Far to Go But Likely to Become Proficient"]
[false,{"$f":"Data!F5","v":"Bill Scheffler"},4,6,0.66666666666666663,{"$f":"IF(C11>=O8,B11,\"\")","v":""},"",{"$f":"IF(C11>=O9,IF(C11<O8,B11,\"\"),\"\")","v":"Bill Scheffler"},", Bertha Richardson, Bill Scheffler",{"$f":"IF(C11>=O10,IF(C11<O9,B11,\"\"),\"\")","v":""},"Dave Sanders, Carolyn Neal",{"$f":"IF(C11<O10,IF(C11=\"\",\"\",B11),\"\")","v":""},"",null,{"$f":"Teacher1Pretest!O11","v":1},"Intervention (Far to Go But Not Likely to Become Proficient)"]
[false,{"$f":"Data!F6","v":"Chris Montgomery"},5,6,0.83333333333333337,{"$f":"IF(C12>=O8,B12,\"\")","v":"Chris Montgomery"},", Chris Montgomery",{"$f":"IF(C12>=O9,IF(C12<O8,B12,\"\"),\"\")","v":""},", Bertha Richardson, Bill Scheffler",{"$f":"IF(C12>=O10,IF(C12<O9,B12,\"\"),\"\")","v":""},"Dave Sanders, Carolyn Neal",{"$f":"IF(C12<O10,IF(C12=\"\",\"\",B12),\"\")","v":""},""]
[false,{"$f":"Data!F7","v":"Darlene Jones"},2,6,0.33333333333333331,{"$f":"IF(C13>=O8,B13,\"\")","v":""},", Chris Montgomery",{"$f":"IF(C13>=O9,IF(C13<O8,B13,\"\"),\"\")","v":""},", Bertha Richardson, Bill Scheffler",{"$f":"IF(C13>=O10,IF(C13<O9,B13,\"\"),\"\")","v":""},"Dave Sanders, Carolyn Neal",{"$f":"IF(C13<O10,IF(C13=\"\",\"\",B13),\"\")","v":"Darlene Jones"},", Darlene Jones"]
[false,{"$f":"Data!F8","v":"Don Rugraff"},5,6,0.83333333333333337,{"$f":"IF(C14>=O8,B14,\"\")","v":"Don Rugraff"},", Chris Montgomery, Don Rugraff",{"$f":"IF(C14>=O9,IF(C14<O8,B14,\"\"),\"\")","v":""},", Bertha Richardson, Bill Scheffler",{"$f":"IF(C14>=O10,IF(C14<O9,B14,\"\"),\"\")","v":""},"Dave Sanders, Carolyn Neal",{"$f":"IF(C14<O10,IF(C14=\"\",\"\",B14),\"\")","v":""},", Darlene Jones"]
[false,{"$f":"Data!F9","v":"Dexter Schraer"},3,6,0.5,{"$f":"IF(C15>=O8,B15,\"\")","v":""},", Chris Montgomery, Don Rugraff",{"$f":"IF(C15>=O9,IF(C15<O8,B15,\"\"),\"\")","v":""},", Bertha Richardson, Bill Scheffler",{"$f":"IF(C15>=O10,IF(C15<O9,B15,\"\"),\"\")","v":"Dexter Schraer"},"Dave Sanders, Carolyn Neal, Dexter Schraer",{"$f":"IF(C15<O10,IF(C15=\"\",\"\",B15),\"\")","v":""},", Darlene Jones"]
[false,{"$f":"Data!F10","v":"Janice Putman"},1,6,0.16666666666666666,{"$f":"IF(C16>=O8,B16,\"\")","v":""},", Chris Montgomery, Don Rugraff",{"$f":"IF(C16>=O9,IF(C16<O8,B16,\"\"),\"\")","v":""},", Bertha Richardson, Bill Scheffler",{"$f":"IF(C16>=O10,IF(C16<O9,B16,\"\"),\"\")","v":""},"Dave Sanders, Carolyn Neal, Dexter Schraer",{"$f":"IF(C16<O10,IF(C16=\"\",\"\",B16),\"\")","v":"Janice Putman"},", Darlene Jones, Janice Putman"]
[false,{"$f":"Data!F11","v":"Julie Sperry"},3,6,0.5,{"$f":"IF(C17>=O8,B17,\"\")","v":""},", Chris Montgomery, Don Rugraff",{"$f":"IF(C17>=O9,IF(C17<O8,B17,\"\"),\"\")","v":""},", Bertha Richardson, Bill Scheffler",{"$f":"IF(C17>=O10,IF(C17<O9,B17,\"\"),\"\")","v":"Julie Sperry"},"Dave Sanders, Carolyn Neal, Dexter Schraer, Julie Sperry",{"$f":"IF(C17<O10,IF(C17=\"\",\"\",B17),\"\")","v":""},", Darlene Jones, Janice Putman"]
[false,{"$f":"Data!F12","v":"Jeanne Rothermel"},1,6,0.16666666666666666,{"$f":"IF(C18>=O8,B18,\"\")","v":""},", Chris Montgomery, Don Rugraff",{"$f":"IF(C18>=O9,IF(C18<O8,B18,\"\"),\"\")","v":""},", Bertha Richardson, Bill Scheffler",{"$f":"IF(C18>=O10,IF(C18<O9,B18,\"\"),\"\")","v":""},"Dave Sanders, Carolyn Neal, Dexter Schraer, Julie Sperry",{"$f":"IF(C18<O10,IF(C18=\"\",\"\",B18),\"\")","v":"Jeanne Rothermel"},", Darlene Jones, Janice Putman, Jeanne Rothermel"]
[false,{"$f":"Data!F13","v":"Rose Coleman"},4,6,0.66666666666666663,{"$f":"IF(C19>=O8,B19,\"\")","v":""},", Chris Montgomery, Don Rugraff",{"$f":"IF(C19>=O9,IF(C19<O8,B19,\"\"),\"\")","v":"Rose Coleman"},", Bertha Richardson, Bill Scheffler, Rose Coleman",{"$f":"IF(C19>=O10,IF(C19<O9,B19,\"\"),\"\")","v":""},"Dave Sanders, Carolyn Neal, Dexter Schraer, Julie Sperry",{"$f":"IF(C19<O10,IF(C19=\"\",\"\",B19),\"\")","v":""},", Darlene Jones, Janice Putman, Jeanne Rothermel"]
[false,{"$f":"Data!F14","v":"Randy Speer"},2,6,0.33333333333333331,{"$f":"IF(C20>=O8,B20,\"\")","v":""},", Chris Montgomery, Don Rugraff",{"$f":"IF(C20>=O9,IF(C20<O8,B20,\"\"),\"\")","v":""},", Bertha Richardson, Bill Scheffler, Rose Coleman",{"$f":"IF(C20>=O10,IF(C20<O9,B20,\"\"),\"\")","v":""},"Dave Sanders, Carolyn Neal, Dexter Schraer, Julie Sperry",{"$f":"IF(C20<O10,IF(C20=\"\",\"\",B20),\"\")","v":"Randy Speer"},", Darlene Jones, Janice Putman, Jeanne Rothermel, Randy Speer"]
[3,{"$f":"Data!F15","v":"**Sam McCauley"},3,6,0.5,{"$f":"IF(C21>=O8,B21,\"\")","v":""},", Chris Montgomery, Don Rugraff",{"$f":"IF(C21>=O9,IF(C21<O8,B21,\"\"),\"\")","v":""},", Bertha Richardson, Bill Scheffler, Rose Coleman",{"$f":"IF(C21>=O10,IF(C21<O9,B21,\"\"),\"\")","v":"**Sam McCauley"},"Dave Sanders, Carolyn Neal, Dexter Schraer, Julie Sperry, **Sam McCauley",{"$f":"IF(C21<O10,IF(C21=\"\",\"\",B21),\"\")","v":""},", Darlene Jones, Janice Putman, Jeanne Rothermel, Randy Speer"]
[false,{"$f":"Data!F16","v":"Tricia Buchanan"},4,6,0.66666666666666663,{"$f":"IF(C22>=O8,B22,\"\")","v":""},", Chris Montgomery, Don Rugraff",{"$f":"IF(C22>=O9,IF(C22<O8,B22,\"\"),\"\")","v":"Tricia Buchanan"},", Bertha Richardson, Bill Scheffler, Rose Coleman, Tricia Buchanan",{"$f":"IF(C22>=O10,IF(C22<O9,B22,\"\"),\"\")","v":""},"Dave Sanders, Carolyn Neal, Dexter Schraer, Julie Sperry, **Sam McCauley",{"$f":"IF(C22<O10,IF(C22=\"\",\"\",B22),\"\")","v":""},", Darlene Jones, Janice Putman, Jeanne Rothermel, Randy Speer"]
[1,{"$f":"Data!F17","v":"**Beth Tobin"},2,6,0.33333333333333331,{"$f":"IF(C23>=O8,B23,\"\")","v":""},", Chris Montgomery, Don Rugraff",{"$f":"IF(C23>=O9,IF(C23<O8,B23,\"\"),\"\")","v":""},", Bertha Richardson, Bill Scheffler, Rose Coleman, Tricia Buchanan",{"$f":"IF(C23>=O10,IF(C23<O9,B23,\"\"),\"\")","v":""},"Dave Sanders, Carolyn Neal, Dexter Schraer, Julie Sperry, **Sam McCauley",{"$f":"IF(C23<O10,IF(C23=\"\",\"\",B23),\"\")","v":"**Beth Tobin"},", Darlene Jones, Janice Putman, Jeanne Rothermel, Randy Speer, **Beth Tobin"]
["FALSE",{"$f":"Data!F18","v":"Student17"},null,"","",{"$f":"IF(C24>=O8,B24,\"\")","v":""},", Chris Montgomery, Don Rugraff",{"$f":"IF(C24>=O9,IF(C24<O8,B24,\"\"),\"\")","v":""},", Bertha Richardson, Bill Scheffler, Rose Coleman, Tricia Buchanan",{"$f":"IF(C24>=O10,IF(C24<O9,B24,\"\"),\"\")","v":""},"Dave Sanders, Carolyn Neal, Dexter Schraer, Julie Sperry, **Sam McCauley",{"$f":"IF(C24<O10,IF(C24=\"\",\"\",B24),\"\")","v":""},", Darlene Jones, Janice Putman, Jeanne Rothermel, Randy Speer, **Beth Tobin"]
["FALSE",{"$f":"Data!F19","v":"Student18"},null,"","",{"$f":"IF(C25>=O8,B25,\"\")","v":""},", Chris Montgomery, Don Rugraff",{"$f":"IF(C25>=O9,IF(C25<O8,B25,\"\"),\"\")","v":""},", Bertha Richardson, Bill Scheffler, Rose Coleman, Tricia Buchanan",{"$f":"IF(C25>=O10,IF(C25<O9,B25,\"\"),\"\")","v":""},"Dave Sanders, Carolyn Neal, Dexter Schraer, Julie Sperry, **Sam McCauley",{"$f":"IF(C25<O10,IF(C25=\"\",\"\",B25),\"\")","v":""},", Darlene Jones, Janice Putman, Jeanne Rothermel, Randy Speer, **Beth Tobin"]
["FALSE",{"$f":"Data!F20","v":"Student19"},null,"","",{"$f":"IF(C26>=O8,B26,\"\")","v":""},", Chris Montgomery, Don Rugraff",{"$f":"IF(C26>=O9,IF(C26<O8,B26,\"\"),\"\")","v":""},", Bertha Richardson, Bill Scheffler, Rose Coleman, Tricia Buchanan",{"$f":"IF(C26>=O10,IF(C26<O9,B26,\"\"),\"\")","v":""},"Dave Sanders, Carolyn Neal, Dexter Schraer, Julie Sperry, **Sam McCauley",{"$f":"IF(C26<O10,IF(C26=\"\",\"\",B26),\"\")","v":""},", Darlene Jones, Janice Putman, Jeanne Rothermel, Randy Speer, **Beth Tobin"]
["FALSE",{"$f":"Data!F21","v":"Student20"},null,"","",{"$f":"IF(C27>=O8,B27,\"\")","v":""},", Chris Montgomery, Don Rugraff",{"$f":"IF(C27>=O9,IF(C27<O8,B27,\"\"),\"\")","v":""},", Bertha Richardson, Bill Scheffler, Rose Coleman, Tricia Buchanan",{"$f":"IF(C27>=O10,IF(C27<O9,B27,\"\"),\"\")","v":""},"Dave Sanders, Carolyn Neal, Dexter Schraer, Julie Sperry, **Sam McCauley",{"$f":"IF(C27<O10,IF(C27=\"\",\"\",B27),\"\")","v":""},", Darlene Jones, Janice Putman, Jeanne Rothermel, Randy Speer, **Beth Tobin"]
["FALSE",{"$f":"Data!F22","v":"Student21"},null,"","",{"$f":"IF(C28>=O8,B28,\"\")","v":""},", Chris Montgomery, Don Rugraff",{"$f":"IF(C28>=O9,IF(C28<O8,B28,\"\"),\"\")","v":""},", Bertha Richardson, Bill Scheffler, Rose Coleman, Tricia Buchanan",{"$f":"IF(C28>=O10,IF(C28<O9,B28,\"\"),\"\")","v":""},"Dave Sanders, Carolyn Neal, Dexter Schraer, Julie Sperry, **Sam McCauley",{"$f":"IF(C28<O10,IF(C28=\"\",\"\",B28),\"\")","v":""},", Darlene Jones, Janice Putman, Jeanne Rothermel, Randy Speer, **Beth Tobin"]
["FALSE",{"$f":"Data!F23","v":"Student22"},null,"","",{"$f":"IF(C29>=O8,B29,\"\")","v":""},", Chris Montgomery, Don Rugraff",{"$f":"IF(C29>=O9,IF(C29<O8,B29,\"\"),\"\")","v":""},", Bertha Richardson, Bill Scheffler, Rose Coleman, Tricia Buchanan",{"$f":"IF(C29>=O10,IF(C29<O9,B29,\"\"),\"\")","v":""},"Dave Sanders, Carolyn Neal, Dexter Schraer, Julie Sperry, **Sam McCauley",{"$f":"IF(C29<O10,IF(C29=\"\",\"\",B29),\"\")","v":""},", Darlene Jones, Janice Putman, Jeanne Rothermel, Randy Speer, **Beth Tobin"]
["FALSE",{"$f":"Data!F24","v":"Student23"},null,"","",{"$f":"IF(C30>=O8,B30,\"\")","v":""},", Chris Montgomery, Don Rugraff",{"$f":"IF(C30>=O9,IF(C30<O8,B30,\"\"),\"\")","v":""},", Bertha Richardson, Bill Scheffler, Rose Coleman, Tricia Buchanan",{"$f":"IF(C30>=O10,IF(C30<O9,B30,\"\"),\"\")","v":""},"Dave Sanders, Carolyn Neal, Dexter Schraer, Julie Sperry, **Sam McCauley",{"$f":"IF(C30<O10,IF(C30=\"\",\"\",B30),\"\")","v":""},", Darlene Jones, Janice Putman, Jeanne Rothermel, Randy Speer, **Beth Tobin"]
["FALSE",{"$f":"Data!F25","v":"Student24"},null,"","",{"$f":"IF(C31>=O8,B31,\"\")","v":""},", Chris Montgomery, Don Rugraff",{"$f":"IF(C31>=O9,IF(C31<O8,B31,\"\"),\"\")","v":""},", Bertha Richardson, Bill Scheffler, Rose Coleman, Tricia Buchanan",{"$f":"IF(C31>=O10,IF(C31<O9,B31,\"\"),\"\")","v":""},"Dave Sanders, Carolyn Neal, Dexter Schraer, Julie Sperry, **Sam McCauley",{"$f":"IF(C31<O10,IF(C31=\"\",\"\",B31),\"\")","v":""},", Darlene Jones, Janice Putman, Jeanne Rothermel, Randy Speer, **Beth Tobin"]
["FALSE",{"$f":"Data!F26","v":"Student25"},null,"","",{"$f":"IF(C32>=O8,B32,\"\")","v":""},", Chris Montgomery, Don Rugraff",{"$f":"IF(C32>=O9,IF(C32<O8,B32,\"\"),\"\")","v":""},", Bertha Richardson, Bill Scheffler, Rose Coleman, Tricia Buchanan",{"$f":"IF(C32>=O10,IF(C32<O9,B32,\"\"),\"\")","v":""},"Dave Sanders, Carolyn Neal, Dexter Schraer, Julie Sperry, **Sam McCauley",{"$f":"IF(C32<O10,IF(C32=\"\",\"\",B32),\"\")","v":""},", Darlene Jones, Janice Putman, Jeanne Rothermel, Randy Speer, **Beth Tobin"]
["FALSE",{"$f":"Data!F27","v":"Student26"},null,"","",{"$f":"IF(C33>=O8,B33,\"\")","v":""},", Chris Montgomery, Don Rugraff",{"$f":"IF(C33>=O9,IF(C33<O8,B33,\"\"),\"\")","v":""},", Bertha Richardson, Bill Scheffler, Rose Coleman, Tricia Buchanan",{"$f":"IF(C33>=O10,IF(C33<O9,B33,\"\"),\"\")","v":""},"Dave Sanders, Carolyn Neal, Dexter Schraer, Julie Sperry, **Sam McCauley",{"$f":"IF(C33<O10,IF(C33=\"\",\"\",B33),\"\")","v":""},", Darlene Jones, Janice Putman, Jeanne Rothermel, Randy Speer, **Beth Tobin"]
["FALSE",{"$f":"Data!F28","v":"Student27"},null,"","",{"$f":"IF(C34>=O8,B34,\"\")","v":""},", Chris Montgomery, Don Rugraff",{"$f":"IF(C34>=O9,IF(C34<O8,B34,\"\"),\"\")","v":""},", Bertha Richardson, Bill Scheffler, Rose Coleman, Tricia Buchanan",{"$f":"IF(C34>=O10,IF(C34<O9,B34,\"\"),\"\")","v":""},"Dave Sanders, Carolyn Neal, Dexter Schraer, Julie Sperry, **Sam McCauley",{"$f":"IF(C34<O10,IF(C34=\"\",\"\",B34),\"\")","v":""},", Darlene Jones, Janice Putman, Jeanne Rothermel, Randy Speer, **Beth Tobin"]
["FALSE",{"$f":"Data!F29","v":"Student28"},null,"","",{"$f":"IF(C35>=O8,B35,\"\")","v":""},", Chris Montgomery, Don Rugraff",{"$f":"IF(C35>=O9,IF(C35<O8,B35,\"\"),\"\")","v":""},", Bertha Richardson, Bill Scheffler, Rose Coleman, Tricia Buchanan",{"$f":"IF(C35>=O10,IF(C35<O9,B35,\"\"),\"\")","v":""},"Dave Sanders, Carolyn Neal, Dexter Schraer, Julie Sperry, **Sam McCauley",{"$f":"IF(C35<O10,IF(C35=\"\",\"\",B35),\"\")","v":""},", Darlene Jones, Janice Putman, Jeanne Rothermel, Randy Speer, **Beth Tobin"]
["FALSE",{"$f":"Data!F30","v":"Student29"},null,"","",{"$f":"IF(C36>=O8,B36,\"\")","v":""},", Chris Montgomery, Don Rugraff",{"$f":"IF(C36>=O9,IF(C36<O8,B36,\"\"),\"\")","v":""},", Bertha Richardson, Bill Scheffler, Rose Coleman, Tricia Buchanan",{"$f":"IF(C36>=O10,IF(C36<O9,B36,\"\"),\"\")","v":""},"Dave Sanders, Carolyn Neal, Dexter Schraer, Julie Sperry, **Sam McCauley",{"$f":"IF(C36<O10,IF(C36=\"\",\"\",B36),\"\")","v":""},", Darlene Jones, Janice Putman, Jeanne Rothermel, Randy Speer, **Beth Tobin"]
["FALSE",{"$f":"Data!F31","v":"Student30"},null,"","",{"$f":"IF(C37>=O8,B37,\"\")","v":""},", Chris Montgomery, Don Rugraff",{"$f":"IF(C37>=O9,IF(C37<O8,B37,\"\"),\"\")","v":""},", Bertha Richardson, Bill Scheffler, Rose Coleman, Tricia Buchanan",{"$f":"IF(C37>=O10,IF(C37<O9,B37,\"\"),\"\")","v":""},"Dave Sanders, Carolyn Neal, Dexter Schraer, Julie Sperry, **Sam McCauley",{"$f":"IF(C37<O10,IF(C37=\"\",\"\",B37),\"\")","v":""},", Darlene Jones, Janice Putman, Jeanne Rothermel, Randy Speer, **Beth Tobin"]
["FALSE"]
[null,"TOTAL",{"$f":"SUM(C8:C37)","v":49},{"$f":"SUM(D8:D37)","v":96},{"$f":"C39/D39","v":0.51041666666666663}]

{"sheet":"Teacher6Pretest","index":12,"n_rows":39,"n_cols":16,"rows_kept":39,"cut":false,"hidden":false,"merged":[[4,1,6,1],[4,2,6,2],[4,3,5,3],[4,4,6,4],[0,1,0,2],[0,3,0,4],[1,1,1,2],[1,3,1,4],[2,1,3,2],[2,3,3,4]]}
[null,{"$f":"IF(Data!N6=\"Other\",Data!N7,Data!N6)","v":"Grade 4"},null,{"$f":"Data!G1","v":"Teacher6"}]
[null,"Meeting Date:",null,{"$f":"Data!N8","v":"2/26/14"}]
[null,"Assessment:",null,{"$f":"Teacher1Pretest!D3","v":"Main Idea- R.I.4.2"}]
[]
[null,"Student Name","Points","Possible","Score - %"]
[]
[null,null,null,{"$f":"Teacher1Pretest!D7","v":6},null,"Proficient",null,"Close",null,"Far",null,"Intervention"]
[{"$f":"IF(ISBLANK(C8),\"FALSE\",IF(LEFT(B8,2)=\"**\",IF(C8>=$O$8,$O$8,IF(C8>=$O$9,$O$9,IF(C8>=$O$10,$O$10,$O$11)))))","v":"FALSE"},{"$f":"Data!G2","v":"Student1"},null,{"$f":"IF(C8=\"\",\"\",$D$7)","v":""},{"$f":"IF(D8=\"\",\"\",C8/$D$7)","v":""},{"$f":"IF(C8>=O8,B8,\"\")","v":""},{"$f":"F8","v":""},{"$f":"IF(C8>=O9,IF(C8<O8,B8,\"\"),\"\")","v":""},{"$f":"H8","v":""},{"$f":"IF(C8>=O10,IF(C8<O9,B8,\"\"),\"\")","v":""},{"$f":"J8","v":""},{"$f":"IF(C8<O10,IF(C8=\"\",\"\",B8),\"\")","v":""},{"$f":"L8","v":""},null,{"$f":"Teacher1Pretest!O8","v":5},"Proficient"]
[{"$f":"IF(ISBLANK(C9),\"FALSE\",IF(LEFT(B9,2)=\"**\",IF(C9>=$O$8,$O$8,IF(C9>=$O$9,$O$9,IF(C9>=$O$10,$O$10,$O$11)))))","v":"FALSE"},{"$f":"Data!G3","v":"Student2"},null,{"$f":"IF(C9=\"\",\"\",$D$7)","v":""},{"$f":"IF(D9=\"\",\"\",C9/$D$7)","v":""},{"$f":"IF(C9>=O8,B9,\"\")","v":""},{"$f":"G8&IF(F9=\"\",\"\",\", \")&F9","v":""},{"$f":"IF(C9>=O9,IF(C9<O8,B9,\"\"),\"\")","v":""},{"$f":"I8&IF(H9=\"\",\"\",\", \")&H9","v":""},{"$f":"IF(C9>=O10,IF(C9<O9,B9,\"\"),\"\")","v":""},{"$f":"K8&IF(J9=\"\",\"\",\", \")&J9","v":""},{"$f":"IF(C9<O10,IF(C9=\"\",\"\",B9),\"\")","v":""},{"$f":"M8&IF(L9=\"\",\"\",\", \")&L9","v":""},null,{"$f":"Teacher1Pretest!O9","v":4},"Close to Proficient"]
["FALSE",{"$f":"Data!G4","v":"Student3"},null,"","",{"$f":"IF(C10>=O8,B10,\"\")","v":""},{"$f":"G9&IF(F10=\"\",\"\",\", \")&F10","v":""},{"$f":"IF(C10>=O9,IF(C10<O8,B10,\"\"),\"\")","v":""},{"$f":"I9&IF(H10=\"\",\"\",\", \")&H10","v":""},{"$f":"IF(C10>=O10,IF(C10<O9,B10,\"\"),\"\")","v":""},{"$f":"K9&IF(J10=\"\",\"\",\", \")&J10","v":""},{"$f":"IF(C10<O10,IF(C10=\"\",\"\",B10),\"\")","v":""},{"$f":"M9&IF(L10=\"\",\"\",\", \")&L10","v":""},null,{"$f":"Teacher1Pretest!O10","v":3},"Far to Go But Likely to Become Proficient"]
["FALSE",{"$f":"Data!G5","v":"Student4"},null,"","",{"$f":"IF(C11>=O8,B11,\"\")","v":""},"",{"$f":"IF(C11>=O9,IF(C11<O8,B11,\"\"),\"\")","v":""},"",{"$f":"IF(C11>=O10,IF(C11<O9,B11,\"\"),\"\")","v":""},"",{"$f":"IF(C11<O10,IF(C11=\"\",\"\",B11),\"\")","v":""},"",null,{"$f":"Teacher1Pretest!O11","v":1},"Intervention (Far to Go But Not Likely to Become Proficient)"]
["FALSE",{"$f":"Data!G6","v":"Student5"},null,"","",{"$f":"IF(C12>=O8,B12,\"\")","v":""},"",{"$f":"IF(C12>=O9,IF(C12<O8,B12,\"\"),\"\")","v":""},"",{"$f":"IF(C12>=O10,IF(C12<O9,B12,\"\"),\"\")","v":""},"",{"$f":"IF(C12<O10,IF(C12=\"\",\"\",B12),\"\")","v":""},""]
["FALSE",{"$f":"Data!G7","v":"Student6"},null,"","",{"$f":"IF(C13>=O8,B13,\"\")","v":""},"",{"$f":"IF(C13>=O9,IF(C13<O8,B13,\"\"),\"\")","v":""},"",{"$f":"IF(C13>=O10,IF(C13<O9,B13,\"\"),\"\")","v":""},"",{"$f":"IF(C13<O10,IF(C13=\"\",\"\",B13),\"\")","v":""},""]
["FALSE",{"$f":"Data!G8","v":"Student7"},null,"","",{"$f":"IF(C14>=O8,B14,\"\")","v":""},"",{"$f":"IF(C14>=O9,IF(C14<O8,B14,\"\"),\"\")","v":""},"",{"$f":"IF(C14>=O10,IF(C14<O9,B14,\"\"),\"\")","v":""},"",{"$f":"IF(C14<O10,IF(C14=\"\",\"\",B14),\"\")","v":""},""]
["FALSE",{"$f":"Data!G9","v":"Student8"},null,"","",{"$f":"IF(C15>=O8,B15,\"\")","v":""},"",{"$f":"IF(C15>=O9,IF(C15<O8,B15,\"\"),\"\")","v":""},"",{"$f":"IF(C15>=O10,IF(C15<O9,B15,\"\"),\"\")","v":""},"",{"$f":"IF(C15<O10,IF(C15=\"\",\"\",B15),\"\")","v":""},""]
["FALSE",{"$f":"Data!G10","v":"Student9"},null,"","",{"$f":"IF(C16>=O8,B16,\"\")","v":""},"",{"$f":"IF(C16>=O9,IF(C16<O8,B16,\"\"),\"\")","v":""},"",{"$f":"IF(C16>=O10,IF(C16<O9,B16,\"\"),\"\")","v":""},"",{"$f":"IF(C16<O10,IF(C16=\"\",\"\",B16),\"\")","v":""},""]
["FALSE",{"$f":"Data!G11","v":"Student10"},null,"","",{"$f":"IF(C17>=O8,B17,\"\")","v":""},"",{"$f":"IF(C17>=O9,IF(C17<O8,B17,\"\"),\"\")","v":""},"",{"$f":"IF(C17>=O10,IF(C17<O9,B17,\"\"),\"\")","v":""},"",{"$f":"IF(C17<O10,IF(C17=\"\",\"\",B17),\"\")","v":""},""]
["FALSE",{"$f":"Data!G12","v":"Student11"},null,"","",{"$f":"IF(C18>=O8,B18,\"\")","v":""},"",{"$f":"IF(C18>=O9,IF(C18<O8,B18,\"\"),\"\")","v":""},"",{"$f":"IF(C18>=O10,IF(C18<O9,B18,\"\"),\"\")","v":""},"",{"$f":"IF(C18<O10,IF(C18=\"\",\"\",B18),\"\")","v":""},""]
["FALSE",{"$f":"Data!G13","v":"Student12"},null,"","",{"$f":"IF(C19>=O8,B19,\"\")","v":""},"",{"$f":"IF(C19>=O9,IF(C19<O8,B19,\"\"),\"\")","v":""},"",{"$f":"IF(C19>=O10,IF(C19<O9,B19,\"\"),\"\")","v":""},"",{"$f":"IF(C19<O10,IF(C19=\"\",\"\",B19),\"\")","v":""},""]
["FALSE",{"$f":"Data!G14","v":"Student13"},null,"","",{"$f":"IF(C20>=O8,B20,\"\")","v":""},"",{"$f":"IF(C20>=O9,IF(C20<O8,B20,\"\"),\"\")","v":""},"",{"$f":"IF(C20>=O10,IF(C20<O9,B20,\"\"),\"\")","v":""},"",{"$f":"IF(C20<O10,IF(C20=\"\",\"\",B20),\"\")","v":""},""]
["FALSE",{"$f":"Data!G15","v":"Student14"},null,"","",{"$f":"IF(C21>=O8,B21,\"\")","v":""},"",{"$f":"IF(C21>=O9,IF(C21<O8,B21,\"\"),\"\")","v":""},"",{"$f":"IF(C21>=O10,IF(C21<O9,B21,\"\"),\"\")","v":""},"",{"$f":"IF(C21<O10,IF(C21=\"\",\"\",B21),\"\")","v":""},""]
["FALSE",{"$f":"Data!G16","v":"Student15"},null,"","",{"$f":"IF(C22>=O8,B22,\"\")","v":""},"",{"$f":"IF(C22>=O9,IF(C22<O8,B22,\"\"),\"\")","v":""},"",{"$f":"IF(C22>=O10,IF(C22<O9,B22,\"\"),\"\")","v":""},"",{"$f":"IF(C22<O10,IF(C22=\"\",\"\",B22),\"\")","v":""},""]
["FALSE",{"$f":"Data!G17","v":"Student16"},null,"","",{"$f":"IF(C23>=O8,B23,\"\")","v":""},"",{"$f":"IF(C23>=O9,IF(C23<O8,B23,\"\"),\"\")","v":""},"",{"$f":"IF(C23>=O10,IF(C23<O9,B23,\"\"),\"\")","v":""},"",{"$f":"IF(C23<O10,IF(C23=\"\",\"\",B23),\"\")","v":""},""]
["FALSE",{"$f":"Data!G18","v":"Student17"},null,"","",{"$f":"IF(C24>=O8,B24,\"\")","v":""},"",{"$f":"IF(C24>=O9,IF(C24<O8,B24,\"\"),\"\")","v":""},"",{"$f":"IF(C24>=O10,IF(C24<O9,B24,\"\"),\"\")","v":""},"",{"$f":"IF(C24<O10,IF(C24=\"\",\"\",B24),\"\")","v":""},""]
["FALSE",{"$f":"Data!G19","v":"Student18"},null,"","",{"$f":"IF(C25>=O8,B25,\"\")","v":""},"",{"$f":"IF(C25>=O9,IF(C25<O8,B25,\"\"),\"\")","v":""},"",{"$f":"IF(C25>=O10,IF(C25<O9,B25,\"\"),\"\")","v":""},"",{"$f":"IF(C25<O10,IF(C25=\"\",\"\",B25),\"\")","v":""},""]
["FALSE",{"$f":"Data!G20","v":"Student19"},null,"","",{"$f":"IF(C26>=O8,B26,\"\")","v":""},"",{"$f":"IF(C26>=O9,IF(C26<O8,B26,\"\"),\"\")","v":""},"",{"$f":"IF(C26>=O10,IF(C26<O9,B26,\"\"),\"\")","v":""},"",{"$f":"IF(C26<O10,IF(C26=\"\",\"\",B26),\"\")","v":""},""]
["FALSE",{"$f":"Data!G21","v":"Student20"},null,"","",{"$f":"IF(C27>=O8,B27,\"\")","v":""},"",{"$f":"IF(C27>=O9,IF(C27<O8,B27,\"\"),\"\")","v":""},"",{"$f":"IF(C27>=O10,IF(C27<O9,B27,\"\"),\"\")","v":""},"",{"$f":"IF(C27<O10,IF(C27=\"\",\"\",B27),\"\")","v":""},""]
["FALSE",{"$f":"Data!G22","v":"Student21"},null,"","",{"$f":"IF(C28>=O8,B28,\"\")","v":""},"",{"$f":"IF(C28>=O9,IF(C28<O8,B28,\"\"),\"\")","v":""},"",{"$f":"IF(C28>=O10,IF(C28<O9,B28,\"\"),\"\")","v":""},"",{"$f":"IF(C28<O10,IF(C28=\"\",\"\",B28),\"\")","v":""},""]
["FALSE",{"$f":"Data!G23","v":"Student22"},null,"","",{"$f":"IF(C29>=O8,B29,\"\")","v":""},"",{"$f":"IF(C29>=O9,IF(C29<O8,B29,\"\"),\"\")","v":""},"",{"$f":"IF(C29>=O10,IF(C29<O9,B29,\"\"),\"\")","v":""},"",{"$f":"IF(C29<O10,IF(C29=\"\",\"\",B29),\"\")","v":""},""]
["FALSE",{"$f":"Data!G24","v":"Student23"},null,"","",{"$f":"IF(C30>=O8,B30,\"\")","v":""},"",{"$f":"IF(C30>=O9,IF(C30<O8,B30,\"\"),\"\")","v":""},"",{"$f":"IF(C30>=O10,IF(C30<O9,B30,\"\"),\"\")","v":""},"",{"$f":"IF(C30<O10,IF(C30=\"\",\"\",B30),\"\")","v":""},""]
["FALSE",{"$f":"Data!G25","v":"Student24"},null,"","",{"$f":"IF(C31>=O8,B31,\"\")","v":""},"",{"$f":"IF(C31>=O9,IF(C31<O8,B31,\"\"),\"\")","v":""},"",{"$f":"IF(C31>=O10,IF(C31<O9,B31,\"\"),\"\")","v":""},"",{"$f":"IF(C31<O10,IF(C31=\"\",\"\",B31),\"\")","v":""},""]
["FALSE",{"$f":"Data!G26","v":"Student25"},null,"","",{"$f":"IF(C32>=O8,B32,\"\")","v":""},"",{"$f":"IF(C32>=O9,IF(C32<O8,B32,\"\"),\"\")","v":""},"",{"$f":"IF(C32>=O10,IF(C32<O9,B32,\"\"),\"\")","v":""},"",{"$f":"IF(C32<O10,IF(C32=\"\",\"\",B32),\"\")","v":""},""]
["FALSE",{"$f":"Data!G27","v":"Student26"},null,"","",{"$f":"IF(C33>=O8,B33,\"\")","v":""},"",{"$f":"IF(C33>=O9,IF(C33<O8,B33,\"\"),\"\")","v":""},"",{"$f":"IF(C33>=O10,IF(C33<O9,B33,\"\"),\"\")","v":""},"",{"$f":"IF(C33<O10,IF(C33=\"\",\"\",B33),\"\")","v":""},""]
["FALSE",{"$f":"Data!G28","v":"Student27"},null,"","",{"$f":"IF(C34>=O8,B34,\"\")","v":""},"",{"$f":"IF(C34>=O9,IF(C34<O8,B34,\"\"),\"\")","v":""},"",{"$f":"IF(C34>=O10,IF(C34<O9,B34,\"\"),\"\")","v":""},"",{"$f":"IF(C34<O10,IF(C34=\"\",\"\",B34),\"\")","v":""},""]
["FALSE",{"$f":"Data!G29","v":"Student28"},null,"","",{"$f":"IF(C35>=O8,B35,\"\")","v":""},"",{"$f":"IF(C35>=O9,IF(C35<O8,B35,\"\"),\"\")","v":""},"",{"$f":"IF(C35>=O10,IF(C35<O9,B35,\"\"),\"\")","v":""},"",{"$f":"IF(C35<O10,IF(C35=\"\",\"\",B35),\"\")","v":""},""]
["FALSE",{"$f":"Data!G30","v":"Student29"},null,"","",{"$f":"IF(C36>=O8,B36,\"\")","v":""},"",{"$f":"IF(C36>=O9,IF(C36<O8,B36,\"\"),\"\")","v":""},"",{"$f":"IF(C36>=O10,IF(C36<O9,B36,\"\"),\"\")","v":""},"",{"$f":"IF(C36<O10,IF(C36=\"\",\"\",B36),\"\")","v":""},""]
["FALSE",{"$f":"Data!G31","v":"Student30"},null,"","",{"$f":"IF(C37>=O8,B37,\"\")","v":""},"",{"$f":"IF(C37>=O9,IF(C37<O8,B37,\"\"),\"\")","v":""},"",{"$f":"IF(C37>=O10,IF(C37<O9,B37,\"\"),\"\")","v":""},"",{"$f":"IF(C37<O10,IF(C37=\"\",\"\",B37),\"\")","v":""},""]
["FALSE"]
[null,"TOTAL",{"$f":"SUM(C8:C37)","v":0},{"$f":"SUM(D8:D37)","v":0},{"$f":"C39/D39","v":{"$error":"#DIV/0!"}}]

{"sheet":"SummaryPretest","index":13,"n_rows":12,"n_cols":18,"rows_kept":12,"cut":false,"hidden":false,"merged":[]}
["Teacher","# Students",null,"# Proficient","% Proficient","Proficient Students",null,"# Close to ","% Close to ","Students Close to Proficiency",null,"# Far to Go","% Far to Go ","Students Far to Go But Likely to Become Proficient",null,"# Intervention","% Intervention","Intervention Students (Far to Go and Not Likely to Become Proficient)"]
[{"$f":"Data!A1","v":"March"},{"$f":"COUNT(Teacher1Pretest!C8:C37)","v":19},null,{"$f":"COUNTIF(Teacher1Pretest!C8:C37,\">=\"&Teacher1Pretest!O8)","v":6},{"$f":"D2/B2","v":0.31578947368421051},{"$f":"IF(Data!N10=\"\",\"\",IF(Data!N11=\"\",\"\",IF(LEFT(Teacher1Pretest!G37,1)=\",\",RIGHT(Teacher1Pretest!G37,LEN(Teacher1Pretest!G37)-1),Teacher1Pretest!G37)))","v":" Jean Fritz, Lois Lowry, Louis Sachar, Shel Silverstein, Seymour Simon, Jane Yolen"},null,{"$f":"COUNTIF(Teacher1Pretest!C8:C37,\">=\"&Teacher1Pretest!O9)-COUNTIF(Teacher1Pretest!C8:C37,\">=\"&Teacher1Pretest!O8)","v":2},{"$f":"H2/B2","v":0.10526315789473684},{"$f":"IF(Data!N10=\"\",\"\",IF(Data!N11=\"\",\"\",IF(Data!N12=\"\",\"\",IF(LEFT(Teacher1Pretest!I37,1)=\",\",RIGHT(Teacher1Pretest!I37, LEN(Teacher1Pretest!I37)-1),Teacher1Pretest!I37))))","v":" Betsy Byars, **Jerry Spinelli"},null,{"$f":"COUNTIF(Teacher1Pretest!C8:C37,\">=\"&Teacher1Pretest!O10)-COUNTIF(Teacher1Pretest!C8:C37,\">=\"&Teacher1Pretest!O9)","v":5},{"$f":"L2/B2","v":0.26315789473684209},{"$f":"IF(Data!N10=\"\",\"\",IF(Data!N11=\"\",\"\",IF(Data!N12=\"\",\"\",IF(Data!N13=\"\",\"\",IF(LEFT(Teacher1Pretest!K37,1)=\",\",RIGHT(Teacher1Pretest!K37, LEN(Teacher1Pretest!K37)-1),Teacher1Pretest!K37)))))","v":"Judy Blome, Patricia MacLachlan, **Barbara Park, Jack Prelutsky, R.L. Stine"},null,{"$f":"COUNTIF(Teacher1Pretest!C8:C37,\"<\"&Teacher1Pretest!O10)","v":6},{"$f":"P2/B2","v":0.31578947368421051},{"$f":"IF(LEFT(Teacher1Pretest!M37,1)=\",\",RIGHT(Teacher1Pretest!M37, LEN(Teacher1Pretest!M37)-1),Teacher1Pretest!M37)","v":" Lewis Carroll, Pam Conrad, C.S. Lewis, **Gary Paulsen, Cynthia Rylant, J.K. Rowling"}]
[{"$f":"Data!B1","v":"Jones"},{"$f":"COUNT(Teacher2Pretest!C8:C37)","v":21},null,{"$f":"COUNTIF(Teacher2Pretest!C8:C37,\">=\"&Teacher2Pretest!O8)","v":7},0.33333333333333331,{"$f":"IF(Data!N10=\"\",\"\",IF(Data!N11=\"\",\"\",IF(LEFT(Teacher2Pretest!G37,1)=\",\",RIGHT(Teacher2Pretest!G37, LEN(Teacher2Pretest!G37)-1),Teacher2Pretest!G37)))","v":"**Justin Bieber, Taylor Swift, Beyonce Knowles, Tim McGraw, **Kelly Clarkson, Bruno Mars, **Bob Dylan"},null,{"$f":"COUNTIF(Teacher2Pretest!C8:C37,\">=\"&Teacher2Pretest!O9)-COUNTIF(Teacher2Pretest!C8:C37,\">=\"&Teacher2Pretest!O8)","v":3},0.14285714285714285,{"$f":"IF(Data!N10=\"\",\"\",IF(Data!N11=\"\",\"\",IF(Data!N12=\"\",\"\",IF(LEFT(Teacher2Pretest!I37,1)=\",\",RIGHT(Teacher2Pretest!I37, LEN(Teacher2Pretest!I37)-1),Teacher2Pretest!I37))))","v":" Madonna, Billy Joel, **Mick Jagger"},null,{"$f":"COUNTIF(Teacher2Pretest!C8:C37,\">=\"&Teacher2Pretest!O10)-COUNTIF(Teacher2Pretest!C8:C37,\">=\"&Teacher2Pretest!O9)","v":3},0.14285714285714285,{"$f":"IF(Data!N10=\"\",\"\",IF(Data!N11=\"\",\"\",IF(Data!N12=\"\",\"\",IF(Data!N13=\"\",\"\",IF(LEFT(Teacher2Pretest!K37,1)=\",\",RIGHT(Teacher2Pretest!K37, LEN(Teacher2Pretest!K37)-1),Teacher2Pretest!K37)))))","v":" Aretha Franklin, Dolly Parton, Eric Clapton"},null,{"$f":"COUNTIF(Teacher2Pretest!C8:C37,\"<\"&Teacher2Pretest!O10)","v":8},0.38095238095238093,{"$f":"IF(LEFT(Teacher2Pretest!M37,1)=\",\",RIGHT(Teacher2Pretest!M37, LEN(Teacher2Pretest!M37)-1),Teacher2Pretest!M37)","v":" Justin Timberlake, Bon Jovi, Elton John, Lady Gaga, **Axl Rose, Tony Bennett, Pat Benatar, Paul McCartney"}]
[{"$f":"Data!C1","v":"Gibson"},{"$f":"COUNT(Teacher3Pretest!C8:C37)","v":20},null,{"$f":"COUNTIF(Teacher3Pretest!C8:C37,\">=\"&Teacher3Pretest!O8)","v":5},0.25,{"$f":"IF(Data!N10=\"\",\"\",IF(Data!N11=\"\",\"\",IF(LEFT(Teacher3Pretest!G37,1)=\",\",RIGHT(Teacher3Pretest!G37, LEN(Teacher3Pretest!G37)-1),Teacher3Pretest!G37)))","v":" Carl Sagan*, **Marie Curie, Sigmund Freud, Stephen Hawking, Howard Gardner"},null,{"$f":"COUNTIF(Teacher3Pretest!C8:C37,\">=\"&Teacher3Pretest!O9)-COUNTIF(Teacher3Pretest!C8:C37,\">=\"&Teacher3Pretest!O8)","v":5},0.25,{"$f":"IF(Data!N10=\"\",\"\",IF(Data!N11=\"\",\"\",IF(Data!N12=\"\",\"\",IF(LEFT(Teacher3Pretest!I37,1)=\",\",RIGHT(Teacher3Pretest!I37, LEN(Teacher3Pretest!I37)-1),Teacher3Pretest!I37))))","v":"**Albert Einstein, Benjamin Franklin, John Dewey, **B.F. Skinner, Lev Vygotsky"},null,{"$f":"COUNTIF(Teacher3Pretest!C8:C37,\">=\"&Teacher3Pretest!O10)-COUNTIF(Teacher3Pretest!C8:C37,\">=\"&Teacher3Pretest!O9)","v":2},0.1,{"$f":"IF(Data!N10=\"\",\"\",IF(Data!N11=\"\",\"\",IF(Data!N12=\"\",\"\",IF(Data!N13=\"\",\"\",IF(LEFT(Teacher3Pretest!K37,1)=\",\",RIGHT(Teacher3Pretest!K37, LEN(Teacher3Pretest!K37)-1),Teacher3Pretest!K37)))))","v":" Henry Ford, Maria Montessori"},null,{"$f":"COUNTIF(Teacher3Pretest!C8:C37,\"<\"&Teacher3Pretest!O10)","v":8},0.4,{"$f":"IF(LEFT(Teacher3Pretest!M37,1)=\",\",RIGHT(Teacher3Pretest!M37, LEN(Teacher3Pretest!M37)-1),Teacher3Pretest!M37)","v":" Alfred Nobel, Charles Darwin, **Isaac Newton, Ivan Pavlov, Jane Goodall, Jean Piaget, **Jonas Salk, Thomas Edison"}]
[{"$f":"Data!D1","v":"Smith"},{"$f":"COUNT(Teacher4Pretest!C8:C37)","v":19},null,{"$f":"COUNTIF(Teacher4Pretest!C8:C37,\">=\"&Teacher4Pretest!O8)","v":7},0.36842105263157893,{"$f":"IF(Data!N10=\"\",\"\",IF(Data!N11=\"\",\"\",IF(LEFT(Teacher4Pretest!G37,1)=\",\",RIGHT(Teacher4Pretest!G37, LEN(Teacher4Pretest!G37)-1),Teacher4Pretest!G37)))","v":" **Michael Phelps, Shaun White, Danica Patrick, LeBron James, Gordie Howe, Martina Navratilova, Yadier Molina"},null,{"$f":"COUNTIF(Teacher4Pretest!C8:C37,\">=\"&Teacher4Pretest!O9)-COUNTIF(Teacher4Pretest!C8:C37,\">=\"&Teacher4Pretest!O8)","v":3},0.15789473684210525,{"$f":"IF(Data!N10=\"\",\"\",IF(Data!N11=\"\",\"\",IF(Data!N12=\"\",\"\",IF(LEFT(Teacher4Pretest!I37,1)=\",\",RIGHT(Teacher4Pretest!I37, LEN(Teacher4Pretest!I37)-1),Teacher4Pretest!I37))))","v":"Michael Jordan, Muhammad Ali, Jeff Gordon"},null,{"$f":"COUNTIF(Teacher4Pretest!C8:C37,\">=\"&Teacher4Pretest!O10)-COUNTIF(Teacher4Pretest!C8:C37,\">=\"&Teacher4Pretest!O9)","v":2},0.10526315789473684,{"$f":"IF(Data!N10=\"\",\"\",IF(Data!N11=\"\",\"\",IF(Data!N12=\"\",\"\",IF(Data!N13=\"\",\"\",IF(LEFT(Teacher4Pretest!K37,1)=\",\",RIGHT(Teacher4Pretest!K37, LEN(Teacher4Pretest!K37)-1),Teacher4Pretest!K37)))))","v":" **Tony Hawk, **George Forman"},null,{"$f":"COUNTIF(Teacher4Pretest!C8:C37,\"<\"&Teacher4Pretest!O10)","v":7},0.36842105263157893,{"$f":"IF(LEFT(Teacher4Pretest!M37,1)=\",\",RIGHT(Teacher4Pretest!M37, LEN(Teacher4Pretest!M37)-1),Teacher4Pretest!M37)","v":" Roger Federer, Wayne Gretzky, **Jim Thorpe, Tiger Woods, Serena Williams, **Joe Montana, Peyton Manning"}]
[{"$f":"Data!E1","v":"Do Not Use"},{"$f":"COUNT('Do Not Use'!B8:B37)","v":0},null,{"$f":"COUNTIF('Do Not Use'!B8:B37,\">=\"&'Do Not Use'!N8)","v":0},{"$error":"#DIV/0!"},{"$f":"IF(Data!N10=\"\",\"\",IF(Data!N11=\"\",\"\",IF(LEFT('Do Not Use'!F37,1)=\",\",RIGHT('Do Not Use'!F37, LEN('Do Not Use'!F37)-1),'Do Not Use'!F37)))","v":""},null,{"$f":"COUNTIF('Do Not Use'!B8:B37,\">=\"&'Do Not Use'!N9)-COUNTIF('Do Not Use'!B8:B37,\">=\"&'Do Not Use'!N8)","v":0},{"$error":"#DIV/0!"},{"$f":"IF(Data!N10=\"\",\"\",IF(Data!N11=\"\",\"\",IF(Data!N12=\"\",\"\",IF(LEFT('Do Not Use'!H37,1)=\",\",RIGHT('Do Not Use'!H37, LEN('Do Not Use'!H37)-1),'Do Not Use'!H37))))","v":""},null,{"$f":"COUNTIF('Do Not Use'!B8:B37,\">=\"&'Do Not Use'!N10)-COUNTIF('Do Not Use'!B8:B37,\">=\"&'Do Not Use'!N9)","v":0},{"$error":"#DIV/0!"},{"$f":"IF(Data!N10=\"\",\"\",IF(Data!N11=\"\",\"\",IF(Data!N12=\"\",\"\",IF(Data!N13=\"\",\"\",IF(LEFT('Do Not Use'!J37,1)=\",\",RIGHT('Do Not Use'!J37, LEN('Do Not Use'!J37)-1),'Do Not Use'!J37)))))","v":""},null,{"$f":"COUNTIF('Do Not Use'!B8:B37,\"<\"&'Do Not Use'!N10)","v":0},{"$error":"#DIV/0!"},{"$f":"IF(LEFT('Do Not Use'!L37,1)=\",\",RIGHT('Do Not Use'!L37, LEN('Do Not Use'!L37)-1),'Do Not Use'!L37)","v":""}]
[{"$f":"Data!F1","v":"Milburn"},{"$f":"COUNT(Teacher5Pretest!C8:C37)","v":16},null,{"$f":"COUNTIF(Teacher5Pretest!C8:C37,\">=\"&Teacher5Pretest!O8)","v":2},0.125,{"$f":"IF(Data!N10=\"\",\"\",IF(Data!N11=\"\",\"\",IF(LEFT(Teacher5Pretest!G37,1)=\",\",RIGHT(Teacher5Pretest!G37, LEN(Teacher5Pretest!G37)-1),Teacher5Pretest!G37)))","v":" Chris Montgomery, Don Rugraff"},null,{"$f":"COUNTIF(Teacher5Pretest!C8:C37,\">=\"&Teacher5Pretest!O9)-COUNTIF(Teacher5Pretest!C8:C37,\">=\"&Teacher5Pretest!O8)","v":4},0.25,{"$f":"IF(Data!N10=\"\",\"\",IF(Data!N11=\"\",\"\",IF(Data!N12=\"\",\"\",IF(LEFT(Teacher5Pretest!I37,1)=\",\",RIGHT(Teacher5Pretest!I37, LEN(Teacher5Pretest!I37)-1),Teacher5Pretest!I37))))","v":" Bertha Richardson, Bill Scheffler, Rose Coleman, Tricia Buchanan"},null,{"$f":"COUNTIF(Teacher5Pretest!C8:C37,\">=\"&Teacher5Pretest!O10)-COUNTIF(Teacher5Pretest!C8:C37,\">=\"&Teacher5Pretest!O9)","v":5},0.3125,{"$f":"IF(Data!N10=\"\",\"\",IF(Data!N11=\"\",\"\",IF(Data!N12=\"\",\"\",IF(Data!N13=\"\",\"\",IF(LEFT(Teacher5Pretest!K37,1)=\",\",RIGHT(Teacher5Pretest!K37, LEN(Teacher5Pretest!K37)-1),Teacher5Pretest!K37)))))","v":"Dave Sanders, Carolyn Neal, Dexter Schraer, Julie Sperry, **Sam McCauley"},null,{"$f":"COUNTIF(Teacher5Pretest!C8:C37,\"<\"&Teacher5Pretest!O10)","v":5},0.3125,{"$f":"IF(LEFT(Teacher5Pretest!M37,1)=\",\",RIGHT(Teacher5Pretest!M37, LEN(Teacher5Pretest!M37)-1),Teacher5Pretest!M37)","v":" Darlene Jones, Janice Putman, Jeanne Rothermel, Randy Speer, **Beth Tobin"}]
[{"$f":"Data!G1","v":"Teacher6"},{"$f":"COUNT(Teacher6Pretest!C8:C37)","v":0},null,{"$f":"COUNTIF(Teacher6Pretest!C8:C37,\">=\"&Teacher6Pretest!O8)","v":0},{"$error":"#DIV/0!"},{"$f":"IF(Data!N10=\"\",\"\",IF(Data!N11=\"\",\"\",IF(LEFT(Teacher6Pretest!G37,1)=\",\",RIGHT(Teacher6Pretest!G37, LEN(Teacher6Pretest!G37)-1),Teacher6Pretest!G37)))","v":""},null,{"$f":"COUNTIF(Teacher6Pretest!C8:C37,\">=\"&Teacher6Pretest!O9)-COUNTIF(Teacher6Pretest!C8:C37,\">=\"&Teacher6Pretest!O8)","v":0},{"$error":"#DIV/0!"},{"$f":"IF(Data!N10=\"\",\"\",IF(Data!N11=\"\",\"\",IF(Data!N12=\"\",\"\",IF(LEFT(Teacher6Pretest!I37,1)=\",\",RIGHT(Teacher6Pretest!I37, LEN(Teacher6Pretest!I37)-1),Teacher6Pretest!I37))))","v":""},null,{"$f":"COUNTIF(Teacher6Pretest!C8:C37,\">=\"&Teacher6Pretest!O10)-COUNTIF(Teacher6Pretest!C8:C37,\">=\"&Teacher6Pretest!O9)","v":0},{"$error":"#DIV/0!"},{"$f":"IF(Data!N10=\"\",\"\",IF(Data!N11=\"\",\"\",IF(Data!N12=\"\",\"\",IF(Data!N13=\"\",\"\",IF(LEFT(Teacher6Pretest!K37,1)=\",\",RIGHT(Teacher6Pretest!K37, LEN(Teacher6Pretest!K37)-1),Teacher6Pretest!K37)))))","v":""},null,{"$f":"COUNTIF(Teacher6Pretest!C8:C37,\"<\"&Teacher6Pretest!O10)","v":0},{"$error":"#DIV/0!"},{"$f":"IF(LEFT(Teacher6Pretest!M37,1)=\",\",RIGHT(Teacher6Pretest!M37, LEN(Teacher6Pretest!M37)-1),Teacher6Pretest!M37)","v":""}]
[]
["TOTAL",{"$f":"SUM(B2:B8)","v":95},null,{"$f":"SUM(D2:D8)","v":27},{"$f":"D10/B10","v":0.28421052631578947},null,null,{"$f":"SUM(H2:H8)","v":17},{"$f":"H10/B10","v":0.17894736842105263},null,null,{"$f":"SUM(L2:L8)","v":17},{"$f":"L10/B10","v":0.17894736842105263},null,null,{"$f":"SUM(P2:P8)","v":34},{"$f":"P10/B10","v":0.35789473684210527}]
[]
[{"$f":"IF(Data!N15=\"YES\",\"SMART Goal\",\"\")","v":"SMART Goal"},null,{"$f":"IF(Data!N15=\"YES\",(D10+H10+L10)/B10,\"\")","v":0.64210526315789473}]

{"sheet":"SG statement","index":14,"n_rows":6,"n_cols":7,"rows_kept":6,"cut":false,"hidden":false,"merged":[[0,0,1,6],[4,0,4,1],[4,5,4,6],[5,0,5,5],[2,0,2,1],[2,2,2,3],[2,4,2,6],[3,0,3,1],[3,2,3,5]]}
["SMART goal statement:"]
[]
["The percentage of",null,{"$f":"IF(Data!N6=\"Other\",Data!N7,Data!N6)","v":"Grade 4"},null,"students scoring proficient"]
["or higher in",null,{"$f":"Data!N9","v":"Main Idea- R.I.4.2"},null,null,null,"will"]
["increase from",null,{"$f":"SummaryPretest!E10","v":0.28421052631578947},"to",{"$f":"SummaryPretest!C12","v":0.64210526315789473},"by the end of the"]
["learning cycle as measured by the CFA administered on",null,null,null,null,null,{"$f":"Data!O8","v":"3/20/14"}]

{"sheet":"Teacher1Post","index":15,"n_rows":39,"n_cols":17,"rows_kept":39,"cut":false,"hidden":false,"merged":[[4,1,6,1],[4,3,6,3],[4,4,5,4],[4,5,6,5],[0,1,0,3],[0,4,0,5],[1,1,1,3],[1,4,1,5],[2,1,3,3],[2,4,3,5],[4,2,6,2]]}
[null,{"$f":"IF(Data!N6=\"Other\",Data!N7,Data!N6)","v":"Grade 4"},null,null,{"$f":"Data!A1","v":"March"}]
[null,"Meeting Date:",null,null,{"$f":"Data!O8","v":"3/20/14"}]
[null,"Assessment:",null,null,{"$f":"Data!N9","v":"Main Idea- R.I.4.2"}]
[]
[null,"Student Name","Pretest %","Post-test Points","Possible","Score - %"]
[]
[null,null,null,null,{"$f":"P7","v":6},null,"Proficient",null,"Close",null,"Far",null,"Intervention",null,null,{"$f":"Data!O10","v":6},"Points Possible on Post-Test"]
[{"$f":"IF(ISBLANK(D8),\"FALSE\",IF(LEFT(B8,2)=\"**\",IF(D8>=$P$8,$P$8,IF(D8>=$P$9,$P$9,IF(D8>=$P$10,$P$10,$P$11)))))","v":false},{"$f":"Data!A2","v":"Judy Blome"},{"$f":"IF(Teacher1Pretest!C8=\"\", \"\", Teacher1Pretest!E8)","v":0.5},5,{"$f":"IF(D8=\"\",\"\",$E$7)","v":6},{"$f":"IF(E8=\"\",\"\",D8/$E$7)","v":0.83333333333333337},{"$f":"IF(D8>=P8,B8,\"\")","v":"Judy Blome"},{"$f":"G8","v":"Judy Blome"},{"$f":"IF(D8>=P9,IF(D8<P8,B8,\"\"),\"\")","v":""},{"$f":"I8","v":""},{"$f":"IF(D8>=P10,IF(D8<P9,B8,\"\"),\"\")","v":""},{"$f":"K8","v":""},{"$f":"IF(D8<P10,IF(D8=\"\",\"\",B8),\"\")","v":""},{"$f":"M8","v":""},null,{"$f":"Data!O11","v":5},"Proficient"]
[{"$f":"IF(ISBLANK(D9),\"FALSE\",IF(LEFT(B9,2)=\"**\",IF(D9>=$P$8,$P$8,IF(D9>=$P$9,$P$9,IF(D9>=$P$10,$P$10,$P$11)))))","v":false},{"$f":"Data!A3","v":"Lewis Carroll"},{"$f":"IF(Teacher1Pretest!C9=\"\", \"\", Teacher1Pretest!E9)","v":0.33333333333333331},3,{"$f":"IF(D9=\"\",\"\",$E$7)","v":6},{"$f":"IF(E9=\"\",\"\",D9/$E$7)","v":0.5},{"$f":"IF(D9>=P8,B9,\"\")","v":""},{"$f":"H8&IF(G9=\"\",\"\",\", \")&G9","v":"Judy Blome"},{"$f":"IF(D9>=P9,IF(D9<P8,B9,\"\"),\"\")","v":""},{"$f":"J8&IF(I9=\"\",\"\",\", \")&I9","v":""},{"$f":"IF(D9>=P10,IF(D9<P9,B9,\"\"),\"\")","v":"Lewis Carroll"},{"$f":"L8&IF(K9=\"\",\"\",\", \")&K9","v":", Lewis Carroll"},{"$f":"IF(D9<P10,IF(D9=\"\",\"\",B9),\"\")","v":""},{"$f":"N8&IF(M9=\"\",\"\",\", \")&M9","v":""},null,{"$f":"Data!O12","v":4},"Close to Proficient"]
[false,{"$f":"Data!A4","v":"Betsy Byars"},{"$f":"IF(Teacher1Pretest!C10=\"\", \"\", Teacher1Pretest!E10)","v":0.66666666666666663},6,6,1,{"$f":"IF(D10>=P8,B10,\"\")","v":"Betsy Byars"},{"$f":"H9&IF(G10=\"\",\"\",\", \")&G10","v":"Judy Blome, Betsy Byars"},{"$f":"IF(D10>=P9,IF(D10<P8,B10,\"\"),\"\")","v":""},{"$f":"J9&IF(I10=\"\",\"\",\", \")&I10","v":""},{"$f":"IF(D10>=P10,IF(D10<P9,B10,\"\"),\"\")","v":""},{"$f":"L9&IF(K10=\"\",\"\",\", \")&K10","v":", Lewis Carroll"},{"$f":"IF(D10<P10,IF(D10=\"\",\"\",B10),\"\")","v":""},{"$f":"N9&IF(M10=\"\",\"\",\", \")&M10","v":""},null,{"$f":"Data!O13","v":3},"Far to Go But Likely to Become Proficient"]
[false,{"$f":"Data!A5","v":"Pam Conrad"},{"$f":"IF(Teacher1Pretest!C11=\"\", \"\", Teacher1Pretest!E11)","v":0.33333333333333331},4,6,0.66666666666666663,{"$f":"IF(D11>=P8,B11,\"\")","v":""},"Judy Blome, Betsy Byars",{"$f":"IF(D11>=P9,IF(D11<P8,B11,\"\"),\"\")","v":"Pam Conrad"},", Pam Conrad",{"$f":"IF(D11>=P10,IF(D11<P9,B11,\"\"),\"\")","v":""},", Lewis Carroll",{"$f":"IF(D11<P10,IF(D11=\"\",\"\",B11),\"\")","v":""},"",null,{"$f":"Data!O14","v":1},"Intervention (Far to Go But Not Likely to Become Proficient)"]
[false,{"$f":"Data!A6","v":"Jean Fritz"},{"$f":"IF(Teacher1Pretest!C12=\"\", \"\", Teacher1Pretest!E12)","v":1},6,6,1,{"$f":"IF(D12>=P8,B12,\"\")","v":"Jean Fritz"},"Judy Blome, Betsy Byars, Jean Fritz",{"$f":"IF(D12>=P9,IF(D12<P8,B12,\"\"),\"\")","v":""},", Pam Conrad",{"$f":"IF(D12>=P10,IF(D12<P9,B12,\"\"),\"\")","v":""},", Lewis Carroll",{"$f":"IF(D12<P10,IF(D12=\"\",\"\",B12),\"\")","v":""},""]
[false,{"$f":"Data!A7","v":"C.S. Lewis"},{"$f":"IF(Teacher1Pretest!C13=\"\", \"\", Teacher1Pretest!E13)","v":0.33333333333333331},1,6,0.16666666666666666,{"$f":"IF(D13>=P8,B13,\"\")","v":""},"Judy Blome, Betsy Byars, Jean Fritz",{"$f":"IF(D13>=P9,IF(D13<P8,B13,\"\"),\"\")","v":""},", Pam Conrad",{"$f":"IF(D13>=P10,IF(D13<P9,B13,\"\"),\"\")","v":""},", Lewis Carroll",{"$f":"IF(D13<P10,IF(D13=\"\",\"\",B13),\"\")","v":"C.S. Lewis"},", C.S. Lewis"]
[false,{"$f":"Data!A8","v":"Lois Lowry"},{"$f":"IF(Teacher1Pretest!C14=\"\", \"\", Teacher1Pretest!E14)","v":1},3,6,0.5,{"$f":"IF(D14>=P8,B14,\"\")","v":""},"Judy Blome, Betsy Byars, Jean Fritz",{"$f":"IF(D14>=P9,IF(D14<P8,B14,\"\"),\"\")","v":""},", Pam Conrad",{"$f":"IF(D14>=P10,IF(D14<P9,B14,\"\"),\"\")","v":"Lois Lowry"},", Lewis Carroll, Lois Lowry",{"$f":"IF(D14<P10,IF(D14=\"\",\"\",B14),\"\")","v":""},", C.S. Lewis"]
[false,{"$f":"Data!A9","v":"Patricia MacLachlan"},{"$f":"IF(Teacher1Pretest!C15=\"\", \"\", Teacher1Pretest!E15)","v":0.5},5,6,0.83333333333333337,{"$f":"IF(D15>=P8,B15,\"\")","v":"Patricia MacLachlan"},"Judy Blome, Betsy Byars, Jean Fritz, Patricia MacLachlan",{"$f":"IF(D15>=P9,IF(D15<P8,B15,\"\"),\"\")","v":""},", Pam Conrad",{"$f":"IF(D15>=P10,IF(D15<P9,B15,\"\"),\"\")","v":""},", Lewis Carroll, Lois Lowry",{"$f":"IF(D15<P10,IF(D15=\"\",\"\",B15),\"\")","v":""},", C.S. Lewis"]
[5,{"$f":"Data!A10","v":"**Barbara Park"},{"$f":"IF(Teacher1Pretest!C16=\"\", \"\", Teacher1Pretest!E16)","v":0.5},6,6,1,{"$f":"IF(D16>=P8,B16,\"\")","v":"**Barbara Park"},"Judy Blome, Betsy Byars, Jean Fritz, Patricia MacLachlan, **Barbara Park",{"$f":"IF(D16>=P9,IF(D16<P8,B16,\"\"),\"\")","v":""},", Pam Conrad",{"$f":"IF(D16>=P10,IF(D16<P9,B16,\"\"),\"\")","v":""},", Lewis Carroll, Lois Lowry",{"$f":"IF(D16<P10,IF(D16=\"\",\"\",B16),\"\")","v":""},", C.S. Lewis"]
[4,{"$f":"Data!A11","v":"**Gary Paulsen"},{"$f":"IF(Teacher1Pretest!C17=\"\", \"\", Teacher1Pretest!E17)","v":0.16666666666666666},4,6,0.66666666666666663,{"$f":"IF(D17>=P8,B17,\"\")","v":""},"Judy Blome, Betsy Byars, Jean Fritz, Patricia MacLachlan, **Barbara Park",{"$f":"IF(D17>=P9,IF(D17<P8,B17,\"\"),\"\")","v":"**Gary Paulsen"},", Pam Conrad, **Gary Paulsen",{"$f":"IF(D17>=P10,IF(D17<P9,B17,\"\"),\"\")","v":""},", Lewis Carroll, Lois Lowry",{"$f":"IF(D17<P10,IF(D17=\"\",\"\",B17),\"\")","v":""},", C.S. Lewis"]
[false,{"$f":"Data!A12","v":"Jack Prelutsky"},{"$f":"IF(Teacher1Pretest!C18=\"\", \"\", Teacher1Pretest!E18)","v":0.5},6,6,1,{"$f":"IF(D18>=P8,B18,\"\")","v":"Jack Prelutsky"},"Judy Blome, Betsy Byars, Jean Fritz, Patricia MacLachlan, **Barbara Park, Jack Prelutsky",{"$f":"IF(D18>=P9,IF(D18<P8,B18,\"\"),\"\")","v":""},", Pam Conrad, **Gary Paulsen",{"$f":"IF(D18>=P10,IF(D18<P9,B18,\"\"),\"\")","v":""},", Lewis Carroll, Lois Lowry",{"$f":"IF(D18<P10,IF(D18=\"\",\"\",B18),\"\")","v":""},", C.S. Lewis"]
[false,{"$f":"Data!A13","v":"Cynthia Rylant"},{"$f":"IF(Teacher1Pretest!C19=\"\", \"\", Teacher1Pretest!E19)","v":0.16666666666666666},4,6,0.66666666666666663,{"$f":"IF(D19>=P8,B19,\"\")","v":""},"Judy Blome, Betsy Byars, Jean Fritz, Patricia MacLachlan, **Barbara Park, Jack Prelutsky",{"$f":"IF(D19>=P9,IF(D19<P8,B19,\"\"),\"\")","v":"Cynthia Rylant"},", Pam Conrad, **Gary Paulsen, Cynthia Rylant",{"$f":"IF(D19>=P10,IF(D19<P9,B19,\"\"),\"\")","v":""},", Lewis Carroll, Lois Lowry",{"$f":"IF(D19<P10,IF(D19=\"\",\"\",B19),\"\")","v":""},", C.S. Lewis"]
[false,{"$f":"Data!A14","v":"Louis Sachar"},{"$f":"IF(Teacher1Pretest!C20=\"\", \"\", Teacher1Pretest!E20)","v":0.83333333333333337},5,6,0.83333333333333337,{"$f":"IF(D20>=P8,B20,\"\")","v":"Louis Sachar"},"Judy Blome, Betsy Byars, Jean Fritz, Patricia MacLachlan, **Barbara Park, Jack Prelutsky, Louis Sachar",{"$f":"IF(D20>=P9,IF(D20<P8,B20,\"\"),\"\")","v":""},", Pam Conrad, **Gary Paulsen, Cynthia Rylant",{"$f":"IF(D20>=P10,IF(D20<P9,B20,\"\"),\"\")","v":""},", Lewis Carroll, Lois Lowry",{"$f":"IF(D20<P10,IF(D20=\"\",\"\",B20),\"\")","v":""},", C.S. Lewis"]
[false,{"$f":"Data!A15","v":"Shel Silverstein"},{"$f":"IF(Teacher1Pretest!C21=\"\", \"\", Teacher1Pretest!E21)","v":1},6,6,1,{"$f":"IF(D21>=P8,B21,\"\")","v":"Shel Silverstein"},"Judy Blome, Betsy Byars, Jean Fritz, Patricia MacLachlan, **Barbara Park, Jack Prelutsky, Louis Sachar, Shel Silverstein",{"$f":"IF(D21>=P9,IF(D21<P8,B21,\"\"),\"\")","v":""},", Pam Conrad, **Gary Paulsen, Cynthia Rylant",{"$f":"IF(D21>=P10,IF(D21<P9,B21,\"\"),\"\")","v":""},", Lewis Carroll, Lois Lowry",{"$f":"IF(D21<P10,IF(D21=\"\",\"\",B21),\"\")","v":""},", C.S. Lewis"]
[false,{"$f":"Data!A16","v":"Seymour Simon"},{"$f":"IF(Teacher1Pretest!C22=\"\", \"\", Teacher1Pretest!E22)","v":0.83333333333333337},5,6,0.83333333333333337,{"$f":"IF(D22>=P8,B22,\"\")","v":"Seymour Simon"},"Judy Blome, Betsy Byars, Jean Fritz, Patricia MacLachlan, **Barbara Park, Jack Prelutsky, Louis Sachar, Shel Silverstein, Seymour Simon",{"$f":"IF(D22>=P9,IF(D22<P8,B22,\"\"),\"\")","v":""},", Pam Conrad, **Gary Paulsen, Cynthia Rylant",{"$f":"IF(D22>=P10,IF(D22<P9,B22,\"\"),\"\")","v":""},", Lewis Carroll, Lois Lowry",{"$f":"IF(D22<P10,IF(D22=\"\",\"\",B22),\"\")","v":""},", C.S. Lewis"]
[5,{"$f":"Data!A17","v":"**Jerry Spinelli"},{"$f":"IF(Teacher1Pretest!C23=\"\", \"\", Teacher1Pretest!E23)","v":0.66666666666666663},5,6,0.83333333333333337,{"$f":"IF(D23>=P8,B23,\"\")","v":"**Jerry Spinelli"},"Judy Blome, Betsy Byars, Jean Fritz, Patricia MacLachlan, **Barbara Park, Jack Prelutsky, Louis Sachar, Shel Silverstein, Seymour Simon, **Jerry Spinelli",{"$f":"IF(D23>=P9,IF(D23<P8,B23,\"\"),\"\")","v":""},", Pam Conrad, **Gary Paulsen, Cynthia Rylant",{"$f":"IF(D23>=P10,IF(D23<P9,B23,\"\"),\"\")","v":""},", Lewis Carroll, Lois Lowry",{"$f":"IF(D23<P10,IF(D23=\"\",\"\",B23),\"\")","v":""},", C.S. Lewis"]
[false,{"$f":"Data!A18","v":"R.L. Stine"},{"$f":"IF(Teacher1Pretest!C24=\"\", \"\", Teacher1Pretest!E24)","v":0.5},4,6,0.66666666666666663,{"$f":"IF(D24>=P8,B24,\"\")","v":""},"Judy Blome, Betsy Byars, Jean Fritz, Patricia MacLachlan, **Barbara Park, Jack Prelutsky, Louis Sachar, Shel Silverstein, Seymour Simon, **Jerry Spinelli",{"$f":"IF(D24>=P9,IF(D24<P8,B24,\"\"),\"\")","v":"R.L. Stine"},", Pam Conrad, **Gary Paulsen, Cynthia Rylant, R.L. Stine",{"$f":"IF(D24>=P10,IF(D24<P9,B24,\"\"),\"\")","v":""},", Lewis Carroll, Lois Lowry",{"$f":"IF(D24<P10,IF(D24=\"\",\"\",B24),\"\")","v":""},", C.S. Lewis"]
[false,{"$f":"Data!A19","v":"Jane Yolen"},{"$f":"IF(Teacher1Pretest!C25=\"\", \"\", Teacher1Pretest!E25)","v":0.83333333333333337},6,6,1,{"$f":"IF(D25>=P8,B25,\"\")","v":"Jane Yolen"},"Judy Blome, Betsy Byars, Jean Fritz, Patricia MacLachlan, **Barbara Park, Jack Prelutsky, Louis Sachar, Shel Silverstein, Seymour Simon, **Jerry Spinelli, Jane Yolen",{"$f":"IF(D25>=P9,IF(D25<P8,B25,\"\"),\"\")","v":""},", Pam Conrad, **Gary Paulsen, Cynthia Rylant, R.L. Stine",{"$f":"IF(D25>=P10,IF(D25<P9,B25,\"\"),\"\")","v":""},", Lewis Carroll, Lois Lowry",{"$f":"IF(D25<P10,IF(D25=\"\",\"\",B25),\"\")","v":""},", C.S. Lewis"]
[false,{"$f":"Data!A20","v":"J.K. Rowling"},{"$f":"IF(Teacher1Pretest!C26=\"\", \"\", Teacher1Pretest!E26)","v":0.16666666666666666},1,6,0.16666666666666666,{"$f":"IF(D26>=P8,B26,\"\")","v":""},"Judy Blome, Betsy Byars, Jean Fritz, Patricia MacLachlan, **Barbara Park, Jack Prelutsky, Louis Sachar, Shel Silverstein, Seymour Simon, **Jerry Spinelli, Jane Yolen",{"$f":"IF(D26>=P9,IF(D26<P8,B26,\"\"),\"\")","v":""},", Pam Conrad, **Gary Paulsen, Cynthia Rylant, R.L. Stine",{"$f":"IF(D26>=P10,IF(D26<P9,B26,\"\"),\"\")","v":""},", Lewis Carroll, Lois Lowry",{"$f":"IF(D26<P10,IF(D26=\"\",\"\",B26),\"\")","v":"J.K. Rowling"},", C.S. Lewis, J.K. Rowling"]
["FALSE",{"$f":"Data!A21","v":"Student20"},{"$f":"IF(Teacher1Pretest!C27=\"\", \"\", Teacher1Pretest!E27)","v":""},null,"","",{"$f":"IF(D27>=P8,B27,\"\")","v":""},"Judy Blome, Betsy Byars, Jean Fritz, Patricia MacLachlan, **Barbara Park, Jack Prelutsky, Louis Sachar, Shel Silverstein, Seymour Simon, **Jerry Spinelli, Jane Yolen",{"$f":"IF(D27>=P9,IF(D27<P8,B27,\"\"),\"\")","v":""},", Pam Conrad, **Gary Paulsen, Cynthia Rylant, R.L. Stine",{"$f":"IF(D27>=P10,IF(D27<P9,B27,\"\"),\"\")","v":""},", Lewis Carroll, Lois Lowry",{"$f":"IF(D27<P10,IF(D27=\"\",\"\",B27),\"\")","v":""},", C.S. Lewis, J.K. Rowling"]
["FALSE",{"$f":"Data!A22","v":"Student21"},{"$f":"IF(Teacher1Pretest!C28=\"\", \"\", Teacher1Pretest!E28)","v":""},null,"","",{"$f":"IF(D28>=P8,B28,\"\")","v":""},"Judy Blome, Betsy Byars, Jean Fritz, Patricia MacLachlan, **Barbara Park, Jack Prelutsky, Louis Sachar, Shel Silverstein, Seymour Simon, **Jerry Spinelli, Jane Yolen",{"$f":"IF(D28>=P9,IF(D28<P8,B28,\"\"),\"\")","v":""},", Pam Conrad, **Gary Paulsen, Cynthia Rylant, R.L. Stine",{"$f":"IF(D28>=P10,IF(D28<P9,B28,\"\"),\"\")","v":""},", Lewis Carroll, Lois Lowry",{"$f":"IF(D28<P10,IF(D28=\"\",\"\",B28),\"\")","v":""},", C.S. Lewis, J.K. Rowling"]
["FALSE",{"$f":"Data!A23","v":"Student22"},{"$f":"IF(Teacher1Pretest!C29=\"\", \"\", Teacher1Pretest!E29)","v":""},null,"","",{"$f":"IF(D29>=P8,B29,\"\")","v":""},"Judy Blome, Betsy Byars, Jean Fritz, Patricia MacLachlan, **Barbara Park, Jack Prelutsky, Louis Sachar, Shel Silverstein, Seymour Simon, **Jerry Spinelli, Jane Yolen",{"$f":"IF(D29>=P9,IF(D29<P8,B29,\"\"),\"\")","v":""},", Pam Conrad, **Gary Paulsen, Cynthia Rylant, R.L. Stine",{"$f":"IF(D29>=P10,IF(D29<P9,B29,\"\"),\"\")","v":""},", Lewis Carroll, Lois Lowry",{"$f":"IF(D29<P10,IF(D29=\"\",\"\",B29),\"\")","v":""},", C.S. Lewis, J.K. Rowling"]
["FALSE",{"$f":"Data!A24","v":"Student23"},{"$f":"IF(Teacher1Pretest!C30=\"\", \"\", Teacher1Pretest!E30)","v":""},null,"","",{"$f":"IF(D30>=P8,B30,\"\")","v":""},"Judy Blome, Betsy Byars, Jean Fritz, Patricia MacLachlan, **Barbara Park, Jack Prelutsky, Louis Sachar, Shel Silverstein, Seymour Simon, **Jerry Spinelli, Jane Yolen",{"$f":"IF(D30>=P9,IF(D30<P8,B30,\"\"),\"\")","v":""},", Pam Conrad, **Gary Paulsen, Cynthia Rylant, R.L. Stine",{"$f":"IF(D30>=P10,IF(D30<P9,B30,\"\"),\"\")","v":""},", Lewis Carroll, Lois Lowry",{"$f":"IF(D30<P10,IF(D30=\"\",\"\",B30),\"\")","v":""},", C.S. Lewis, J.K. Rowling"]
["FALSE",{"$f":"Data!A25","v":"Student24"},{"$f":"IF(Teacher1Pretest!C31=\"\", \"\", Teacher1Pretest!E31)","v":""},null,"","",{"$f":"IF(D31>=P8,B31,\"\")","v":""},"Judy Blome, Betsy Byars, Jean Fritz, Patricia MacLachlan, **Barbara Park, Jack Prelutsky, Louis Sachar, Shel Silverstein, Seymour Simon, **Jerry Spinelli, Jane Yolen",{"$f":"IF(D31>=P9,IF(D31<P8,B31,\"\"),\"\")","v":""},", Pam Conrad, **Gary Paulsen, Cynthia Rylant, R.L. Stine",{"$f":"IF(D31>=P10,IF(D31<P9,B31,\"\"),\"\")","v":""},", Lewis Carroll, Lois Lowry",{"$f":"IF(D31<P10,IF(D31=\"\",\"\",B31),\"\")","v":""},", C.S. Lewis, J.K. Rowling"]
["FALSE",{"$f":"Data!A26","v":"Student25"},{"$f":"IF(Teacher1Pretest!C32=\"\", \"\", Teacher1Pretest!E32)","v":""},null,"","",{"$f":"IF(D32>=P8,B32,\"\")","v":""},"Judy Blome, Betsy Byars, Jean Fritz, Patricia MacLachlan, **Barbara Park, Jack Prelutsky, Louis Sachar, Shel Silverstein, Seymour Simon, **Jerry Spinelli, Jane Yolen",{"$f":"IF(D32>=P9,IF(D32<P8,B32,\"\"),\"\")","v":""},", Pam Conrad, **Gary Paulsen, Cynthia Rylant, R.L. Stine",{"$f":"IF(D32>=P10,IF(D32<P9,B32,\"\"),\"\")","v":""},", Lewis Carroll, Lois Lowry",{"$f":"IF(D32<P10,IF(D32=\"\",\"\",B32),\"\")","v":""},", C.S. Lewis, J.K. Rowling"]
["FALSE",{"$f":"Data!A27","v":"Student26"},{"$f":"IF(Teacher1Pretest!C33=\"\", \"\", Teacher1Pretest!E33)","v":""},null,"","",{"$f":"IF(D33>=P8,B33,\"\")","v":""},"Judy Blome, Betsy Byars, Jean Fritz, Patricia MacLachlan, **Barbara Park, Jack Prelutsky, Louis Sachar, Shel Silverstein, Seymour Simon, **Jerry Spinelli, Jane Yolen",{"$f":"IF(D33>=P9,IF(D33<P8,B33,\"\"),\"\")","v":""},", Pam Conrad, **Gary Paulsen, Cynthia Rylant, R.L. Stine",{"$f":"IF(D33>=P10,IF(D33<P9,B33,\"\"),\"\")","v":""},", Lewis Carroll, Lois Lowry",{"$f":"IF(D33<P10,IF(D33=\"\",\"\",B33),\"\")","v":""},", C.S. Lewis, J.K. Rowling"]
["FALSE",{"$f":"Data!A28","v":"Student27"},{"$f":"IF(Teacher1Pretest!C34=\"\", \"\", Teacher1Pretest!E34)","v":""},null,"","",{"$f":"IF(D34>=P8,B34,\"\")","v":""},"Judy Blome, Betsy Byars, Jean Fritz, Patricia MacLachlan, **Barbara Park, Jack Prelutsky, Louis Sachar, Shel Silverstein, Seymour Simon, **Jerry Spinelli, Jane Yolen",{"$f":"IF(D34>=P9,IF(D34<P8,B34,\"\"),\"\")","v":""},", Pam Conrad, **Gary Paulsen, Cynthia Rylant, R.L. Stine",{"$f":"IF(D34>=P10,IF(D34<P9,B34,\"\"),\"\")","v":""},", Lewis Carroll, Lois Lowry",{"$f":"IF(D34<P10,IF(D34=\"\",\"\",B34),\"\")","v":""},", C.S. Lewis, J.K. Rowling"]
["FALSE",{"$f":"Data!A29","v":"Student28"},{"$f":"IF(Teacher1Pretest!C35=\"\", \"\", Teacher1Pretest!E35)","v":""},null,"","",{"$f":"IF(D35>=P8,B35,\"\")","v":""},"Judy Blome, Betsy Byars, Jean Fritz, Patricia MacLachlan, **Barbara Park, Jack Prelutsky, Louis Sachar, Shel Silverstein, Seymour Simon, **Jerry Spinelli, Jane Yolen",{"$f":"IF(D35>=P9,IF(D35<P8,B35,\"\"),\"\")","v":""},", Pam Conrad, **Gary Paulsen, Cynthia Rylant, R.L. Stine",{"$f":"IF(D35>=P10,IF(D35<P9,B35,\"\"),\"\")","v":""},", Lewis Carroll, Lois Lowry",{"$f":"IF(D35<P10,IF(D35=\"\",\"\",B35),\"\")","v":""},", C.S. Lewis, J.K. Rowling"]
["FALSE",{"$f":"Data!A30","v":"Student29"},{"$f":"IF(Teacher1Pretest!C36=\"\", \"\", Teacher1Pretest!E36)","v":""},null,"","",{"$f":"IF(D36>=P8,B36,\"\")","v":""},"Judy Blome, Betsy Byars, Jean Fritz, Patricia MacLachlan, **Barbara Park, Jack Prelutsky, Louis Sachar, Shel Silverstein, Seymour Simon, **Jerry Spinelli, Jane Yolen",{"$f":"IF(D36>=P9,IF(D36<P8,B36,\"\"),\"\")","v":""},", Pam Conrad, **Gary Paulsen, Cynthia Rylant, R.L. Stine",{"$f":"IF(D36>=P10,IF(D36<P9,B36,\"\"),\"\")","v":""},", Lewis Carroll, Lois Lowry",{"$f":"IF(D36<P10,IF(D36=\"\",\"\",B36),\"\")","v":""},", C.S. Lewis, J.K. Rowling"]
["FALSE",{"$f":"Data!A31","v":"Student30"},{"$f":"IF(Teacher1Pretest!C37=\"\", \"\", Teacher1Pretest!E37)","v":""},null,"","",{"$f":"IF(D37>=P8,B37,\"\")","v":""},"Judy Blome, Betsy Byars, Jean Fritz, Patricia MacLachlan, **Barbara Park, Jack Prelutsky, Louis Sachar, Shel Silverstein, Seymour Simon, **Jerry Spinelli, Jane Yolen",{"$f":"IF(D37>=P9,IF(D37<P8,B37,\"\"),\"\")","v":""},", Pam Conrad, **Gary Paulsen, Cynthia Rylant, R.L. Stine",{"$f":"IF(D37>=P10,IF(D37<P9,B37,\"\"),\"\")","v":""},", Lewis Carroll, Lois Lowry",{"$f":"IF(D37<P10,IF(D37=\"\",\"\",B37),\"\")","v":""},", C.S. Lewis, J.K. Rowling"]
["FALSE"]
[null,"TOTAL",null,{"$f":"SUM(D8:D37)","v":85},{"$f":"SUM(E8:E37)","v":114},{"$f":"D39/E39","v":0.74561403508771928}]

{"sheet":"Teacher2Post","index":16,"n_rows":39,"n_cols":17,"rows_kept":39,"cut":false,"hidden":false,"merged":[[4,1,6,1],[4,3,6,3],[4,4,5,4],[4,5,6,5],[0,1,0,3],[0,4,0,5],[1,1,1,3],[1,4,1,5],[2,1,3,3],[2,4,3,5],[4,2,6,2]]}
[null,{"$f":"IF(Data!N6=\"Other\",Data!N7,Data!N6)","v":"Grade 4"},null,null,{"$f":"Data!B1","v":"Jones"}]
[null,"Meeting Date:",null,null,{"$f":"Data!O8","v":"3/20/14"}]
[null,"Assessment:",null,null,{"$f":"Teacher1Pretest!D3","v":"Main Idea- R.I.4.2"}]
[]
[null,"Student Name","Pretest %","Post-test Points","Possible","Score - %"]
[null,null,"Pretest Points"]
[null,null,null,null,{"$f":"Teacher1Post!P7","v":6},null,"Proficient",null,"Close",null,"Far",null,"Intervention",null,null,{"$f":"Data!O10","v":6},"Points Possible on Post-Test"]
[{"$f":"IF(ISBLANK(D8),\"FALSE\",IF(LEFT(B8,2)=\"**\",IF(D8>=$P$8,$P$8,IF(D8>=$P$9,$P$9,IF(D8>=$P$10,$P$10,$P$11)))))","v":5},{"$f":"Data!B2","v":"**Justin Bieber"},{"$f":"IF(Teacher2Pretest!C8=\"\",\"\",Teacher2Pretest!E8)","v":0.83333333333333337},5,{"$f":"IF(D8=\"\",\"\",$E$7)","v":6},{"$f":"IF(E8=\"\",\"\",D8/$E$7)","v":0.83333333333333337},{"$f":"IF(D8>=P8,B8,\"\")","v":"**Justin Bieber"},{"$f":"G8","v":"**Justin Bieber"},{"$f":"IF(D8>=P9,IF(D8<P8,B8,\"\"),\"\")","v":""},{"$f":"I8","v":""},{"$f":"IF(D8>=P10,IF(D8<P9,B8,\"\"),\"\")","v":""},{"$f":"K8","v":""},{"$f":"IF(D8<P10,IF(D8=\"\",\"\",B8),\"\")","v":""},{"$f":"M8","v":""},null,{"$f":"Data!O11","v":5},"Proficient"]
[{"$f":"IF(ISBLANK(D9),\"FALSE\",IF(LEFT(B9,2)=\"**\",IF(D9>=$P$8,$P$8,IF(D9>=$P$9,$P$9,IF(D9>=$P$10,$P$10,$P$11)))))","v":false},{"$f":"Data!B3","v":"Taylor Swift"},{"$f":"IF(Teacher2Pretest!C9=\"\",\"\",Teacher2Pretest!E9)","v":0.83333333333333337},5,{"$f":"IF(D9=\"\",\"\",$E$7)","v":6},{"$f":"IF(E9=\"\",\"\",D9/$E$7)","v":0.83333333333333337},{"$f":"IF(D9>=P8,B9,\"\")","v":"Taylor Swift"},{"$f":"H8&IF(G9=\"\",\"\",\", \")&G9","v":"**Justin Bieber, Taylor Swift"},{"$f":"IF(D9>=P9,IF(D9<P8,B9,\"\"),\"\")","v":""},{"$f":"J8&IF(I9=\"\",\"\",\", \")&I9","v":""},{"$f":"IF(D9>=P10,IF(D9<P9,B9,\"\"),\"\")","v":""},{"$f":"L8&IF(K9=\"\",\"\",\", \")&K9","v":""},{"$f":"IF(D9<P10,IF(D9=\"\",\"\",B9),\"\")","v":""},{"$f":"N8&IF(M9=\"\",\"\",\", \")&M9","v":""},null,{"$f":"Data!O12","v":4},"Close to Proficient"]
[false,{"$f":"Data!B4","v":"Beyonce Knowles"},{"$f":"IF(Teacher2Pretest!C10=\"\",\"\",Teacher2Pretest!E10)","v":0.83333333333333337},5,6,0.83333333333333337,{"$f":"IF(D10>=P8,B10,\"\")","v":"Beyonce Knowles"},{"$f":"H9&IF(G10=\"\",\"\",\", \")&G10","v":"**Justin Bieber, Taylor Swift, Beyonce Knowles"},{"$f":"IF(D10>=P9,IF(D10<P8,B10,\"\"),\"\")","v":""},{"$f":"J9&IF(I10=\"\",\"\",\", \")&I10","v":""},{"$f":"IF(D10>=P10,IF(D10<P9,B10,\"\"),\"\")","v":""},{"$f":"L9&IF(K10=\"\",\"\",\", \")&K10","v":""},{"$f":"IF(D10<P10,IF(D10=\"\",\"\",B10),\"\")","v":""},{"$f":"N9&IF(M10=\"\",\"\",\", \")&M10","v":""},null,{"$f":"Data!O13","v":3},"Far to Go But Likely to Become Proficient"]
[false,{"$f":"Data!B5","v":"Madonna"},{"$f":"IF(Teacher2Pretest!C11=\"\",\"\",Teacher2Pretest!E11)","v":0.66666666666666663},5,6,0.83333333333333337,{"$f":"IF(D11>=P8,B11,\"\")","v":"Madonna"},"**Justin Bieber, Taylor Swift, Beyonce Knowles, Madonna",{"$f":"IF(D11>=P9,IF(D11<P8,B11,\"\"),\"\")","v":""},"",{"$f":"IF(D11>=P10,IF(D11<P9,B11,\"\"),\"\")","v":""},"",{"$f":"IF(D11<P10,IF(D11=\"\",\"\",B11),\"\")","v":""},"",null,{"$f":"Data!O14","v":1},"Intervention (Far to Go But Not Likely to Become Proficient)"]
[false,{"$f":"Data!B6","v":"Justin Timberlake"},{"$f":"IF(Teacher2Pretest!C12=\"\",\"\",Teacher2Pretest!E12)","v":0.16666666666666666},2,6,0.33333333333333331,{"$f":"IF(D12>=P8,B12,\"\")","v":""},"**Justin Bieber, Taylor Swift, Beyonce Knowles, Madonna",{"$f":"IF(D12>=P9,IF(D12<P8,B12,\"\"),\"\")","v":""},"",{"$f":"IF(D12>=P10,IF(D12<P9,B12,\"\"),\"\")","v":""},"",{"$f":"IF(D12<P10,IF(D12=\"\",\"\",B12),\"\")","v":"Justin Timberlake"},", Justin Timberlake"]
[false,{"$f":"Data!B7","v":"Bon Jovi"},{"$f":"IF(Teacher2Pretest!C13=\"\",\"\",Teacher2Pretest!E13)","v":0.33333333333333331},3,6,0.5,{"$f":"IF(D13>=P8,B13,\"\")","v":""},"**Justin Bieber, Taylor Swift, Beyonce Knowles, Madonna",{"$f":"IF(D13>=P9,IF(D13<P8,B13,\"\"),\"\")","v":""},"",{"$f":"IF(D13>=P10,IF(D13<P9,B13,\"\"),\"\")","v":"Bon Jovi"},", Bon Jovi",{"$f":"IF(D13<P10,IF(D13=\"\",\"\",B13),\"\")","v":""},", Justin Timberlake"]
[false,{"$f":"Data!B8","v":"Tim McGraw"},{"$f":"IF(Teacher2Pretest!C14=\"\",\"\",Teacher2Pretest!E14)","v":0.83333333333333337},3,6,0.5,{"$f":"IF(D14>=P8,B14,\"\")","v":""},"**Justin Bieber, Taylor Swift, Beyonce Knowles, Madonna",{"$f":"IF(D14>=P9,IF(D14<P8,B14,\"\"),\"\")","v":""},"",{"$f":"IF(D14>=P10,IF(D14<P9,B14,\"\"),\"\")","v":"Tim McGraw"},", Bon Jovi, Tim McGraw",{"$f":"IF(D14<P10,IF(D14=\"\",\"\",B14),\"\")","v":""},", Justin Timberlake"]
[false,{"$f":"Data!B9","v":"Elton John"},{"$f":"IF(Teacher2Pretest!C15=\"\",\"\",Teacher2Pretest!E15)","v":0.16666666666666666},0,6,0,{"$f":"IF(D15>=P8,B15,\"\")","v":""},"**Justin Bieber, Taylor Swift, Beyonce Knowles, Madonna",{"$f":"IF(D15>=P9,IF(D15<P8,B15,\"\"),\"\")","v":""},"",{"$f":"IF(D15>=P10,IF(D15<P9,B15,\"\"),\"\")","v":""},", Bon Jovi, Tim McGraw",{"$f":"IF(D15<P10,IF(D15=\"\",\"\",B15),\"\")","v":"Elton John"},", Justin Timberlake, Elton John"]
[5,{"$f":"Data!B10","v":"**Kelly Clarkson"},{"$f":"IF(Teacher2Pretest!C16=\"\",\"\",Teacher2Pretest!E16)","v":0.83333333333333337},6,6,1,{"$f":"IF(D16>=P8,B16,\"\")","v":"**Kelly Clarkson"},"**Justin Bieber, Taylor Swift, Beyonce Knowles, Madonna, **Kelly Clarkson",{"$f":"IF(D16>=P9,IF(D16<P8,B16,\"\"),\"\")","v":""},"",{"$f":"IF(D16>=P10,IF(D16<P9,B16,\"\"),\"\")","v":""},", Bon Jovi, Tim McGraw",{"$f":"IF(D16<P10,IF(D16=\"\",\"\",B16),\"\")","v":""},", Justin Timberlake, Elton John"]
[false,{"$f":"Data!B11","v":"Aretha Franklin"},{"$f":"IF(Teacher2Pretest!C17=\"\",\"\",Teacher2Pretest!E17)","v":0.5},5,6,0.83333333333333337,{"$f":"IF(D17>=P8,B17,\"\")","v":"Aretha Franklin"},"**Justin Bieber, Taylor Swift, Beyonce Knowles, Madonna, **Kelly Clarkson, Aretha Franklin",{"$f":"IF(D17>=P9,IF(D17<P8,B17,\"\"),\"\")","v":""},"",{"$f":"IF(D17>=P10,IF(D17<P9,B17,\"\"),\"\")","v":""},", Bon Jovi, Tim McGraw",{"$f":"IF(D17<P10,IF(D17=\"\",\"\",B17),\"\")","v":""},", Justin Timberlake, Elton John"]
[false,{"$f":"Data!B12","v":"Lady Gaga"},{"$f":"IF(Teacher2Pretest!C18=\"\",\"\",Teacher2Pretest!E18)","v":0.33333333333333331},5,6,0.83333333333333337,{"$f":"IF(D18>=P8,B18,\"\")","v":"Lady Gaga"},"**Justin Bieber, Taylor Swift, Beyonce Knowles, Madonna, **Kelly Clarkson, Aretha Franklin, Lady Gaga",{"$f":"IF(D18>=P9,IF(D18<P8,B18,\"\"),\"\")","v":""},"",{"$f":"IF(D18>=P10,IF(D18<P9,B18,\"\"),\"\")","v":""},", Bon Jovi, Tim McGraw",{"$f":"IF(D18<P10,IF(D18=\"\",\"\",B18),\"\")","v":""},", Justin Timberlake, Elton John"]
[false,{"$f":"Data!B13","v":"Billy Joel"},{"$f":"IF(Teacher2Pretest!C19=\"\",\"\",Teacher2Pretest!E19)","v":0.66666666666666663},4,6,0.66666666666666663,{"$f":"IF(D19>=P8,B19,\"\")","v":""},"**Justin Bieber, Taylor Swift, Beyonce Knowles, Madonna, **Kelly Clarkson, Aretha Franklin, Lady Gaga",{"$f":"IF(D19>=P9,IF(D19<P8,B19,\"\"),\"\")","v":"Billy Joel"},", Billy Joel",{"$f":"IF(D19>=P10,IF(D19<P9,B19,\"\"),\"\")","v":""},", Bon Jovi, Tim McGraw",{"$f":"IF(D19<P10,IF(D19=\"\",\"\",B19),\"\")","v":""},", Justin Timberlake, Elton John"]
[false,{"$f":"Data!B14","v":"Bruno Mars"},{"$f":"IF(Teacher2Pretest!C20=\"\",\"\",Teacher2Pretest!E20)","v":1},5,6,0.83333333333333337,{"$f":"IF(D20>=P8,B20,\"\")","v":"Bruno Mars"},"**Justin Bieber, Taylor Swift, Beyonce Knowles, Madonna, **Kelly Clarkson, Aretha Franklin, Lady Gaga, Bruno Mars",{"$f":"IF(D20>=P9,IF(D20<P8,B20,\"\"),\"\")","v":""},", Billy Joel",{"$f":"IF(D20>=P10,IF(D20<P9,B20,\"\"),\"\")","v":""},", Bon Jovi, Tim McGraw",{"$f":"IF(D20<P10,IF(D20=\"\",\"\",B20),\"\")","v":""},", Justin Timberlake, Elton John"]
[false,{"$f":"Data!B15","v":"Dolly Parton"},{"$f":"IF(Teacher2Pretest!C21=\"\",\"\",Teacher2Pretest!E21)","v":0.5},5,6,0.83333333333333337,{"$f":"IF(D21>=P8,B21,\"\")","v":"Dolly Parton"},"**Justin Bieber, Taylor Swift, Beyonce Knowles, Madonna, **Kelly Clarkson, Aretha Franklin, Lady Gaga, Bruno Mars, Dolly Parton",{"$f":"IF(D21>=P9,IF(D21<P8,B21,\"\"),\"\")","v":""},", Billy Joel",{"$f":"IF(D21>=P10,IF(D21<P9,B21,\"\"),\"\")","v":""},", Bon Jovi, Tim McGraw",{"$f":"IF(D21<P10,IF(D21=\"\",\"\",B21),\"\")","v":""},", Justin Timberlake, Elton John"]
[4,{"$f":"Data!B16","v":"**Axl Rose"},{"$f":"IF(Teacher2Pretest!C22=\"\",\"\",Teacher2Pretest!E22)","v":0.33333333333333331},4,6,0.66666666666666663,{"$f":"IF(D22>=P8,B22,\"\")","v":""},"**Justin Bieber, Taylor Swift, Beyonce Knowles, Madonna, **Kelly Clarkson, Aretha Franklin, Lady Gaga, Bruno Mars, Dolly Parton",{"$f":"IF(D22>=P9,IF(D22<P8,B22,\"\"),\"\")","v":"**Axl Rose"},", Billy Joel, **Axl Rose",{"$f":"IF(D22>=P10,IF(D22<P9,B22,\"\"),\"\")","v":""},", Bon Jovi, Tim McGraw",{"$f":"IF(D22<P10,IF(D22=\"\",\"\",B22),\"\")","v":""},", Justin Timberlake, Elton John"]
[false,{"$f":"Data!B17","v":"Tony Bennett"},{"$f":"IF(Teacher2Pretest!C23=\"\",\"\",Teacher2Pretest!E23)","v":0.33333333333333331},5,6,0.83333333333333337,{"$f":"IF(D23>=P8,B23,\"\")","v":"Tony Bennett"},"**Justin Bieber, Taylor Swift, Beyonce Knowles, Madonna, **Kelly Clarkson, Aretha Franklin, Lady Gaga, Bruno Mars, Dolly Parton, Tony Bennett",{"$f":"IF(D23>=P9,IF(D23<P8,B23,\"\"),\"\")","v":""},", Billy Joel, **Axl Rose",{"$f":"IF(D23>=P10,IF(D23<P9,B23,\"\"),\"\")","v":""},", Bon Jovi, Tim McGraw",{"$f":"IF(D23<P10,IF(D23=\"\",\"\",B23),\"\")","v":""},", Justin Timberlake, Elton John"]
[false,{"$f":"Data!B18","v":"Pat Benatar"},{"$f":"IF(Teacher2Pretest!C24=\"\",\"\",Teacher2Pretest!E24)","v":0.16666666666666666},5,6,0.83333333333333337,{"$f":"IF(D24>=P8,B24,\"\")","v":"Pat Benatar"},"**Justin Bieber, Taylor Swift, Beyonce Knowles, Madonna, **Kelly Clarkson, Aretha Franklin, Lady Gaga, Bruno Mars, Dolly Parton, Tony Bennett, Pat Benatar",{"$f":"IF(D24>=P9,IF(D24<P8,B24,\"\"),\"\")","v":""},", Billy Joel, **Axl Rose",{"$f":"IF(D24>=P10,IF(D24<P9,B24,\"\"),\"\")","v":""},", Bon Jovi, Tim McGraw",{"$f":"IF(D24<P10,IF(D24=\"\",\"\",B24),\"\")","v":""},", Justin Timberlake, Elton John"]
[3,{"$f":"Data!B19","v":"**Bob Dylan"},{"$f":"IF(Teacher2Pretest!C25=\"\",\"\",Teacher2Pretest!E25)","v":0.83333333333333337},3,6,0.5,{"$f":"IF(D25>=P8,B25,\"\")","v":""},"**Justin Bieber, Taylor Swift, Beyonce Knowles, Madonna, **Kelly Clarkson, Aretha Franklin, Lady Gaga, Bruno Mars, Dolly Parton, Tony Bennett, Pat Benatar",{"$f":"IF(D25>=P9,IF(D25<P8,B25,\"\"),\"\")","v":""},", Billy Joel, **Axl Rose",{"$f":"IF(D25>=P10,IF(D25<P9,B25,\"\"),\"\")","v":"**Bob Dylan"},", Bon Jovi, Tim McGraw, **Bob Dylan",{"$f":"IF(D25<P10,IF(D25=\"\",\"\",B25),\"\")","v":""},", Justin Timberlake, Elton John"]
[false,{"$f":"Data!B20","v":"Eric Clapton"},{"$f":"IF(Teacher2Pretest!C26=\"\",\"\",Teacher2Pretest!E26)","v":0.5},3,6,0.5,{"$f":"IF(D26>=P8,B26,\"\")","v":""},"**Justin Bieber, Taylor Swift, Beyonce Knowles, Madonna, **Kelly Clarkson, Aretha Franklin, Lady Gaga, Bruno Mars, Dolly Parton, Tony Bennett, Pat Benatar",{"$f":"IF(D26>=P9,IF(D26<P8,B26,\"\"),\"\")","v":""},", Billy Joel, **Axl Rose",{"$f":"IF(D26>=P10,IF(D26<P9,B26,\"\"),\"\")","v":"Eric Clapton"},", Bon Jovi, Tim McGraw, **Bob Dylan, Eric Clapton",{"$f":"IF(D26<P10,IF(D26=\"\",\"\",B26),\"\")","v":""},", Justin Timberlake, Elton John"]
[false,{"$f":"Data!B21","v":"Paul McCartney"},{"$f":"IF(Teacher2Pretest!C27=\"\",\"\",Teacher2Pretest!E27)","v":0.33333333333333331},4,6,0.66666666666666663,{"$f":"IF(D27>=P8,B27,\"\")","v":""},"**Justin Bieber, Taylor Swift, Beyonce Knowles, Madonna, **Kelly Clarkson, Aretha Franklin, Lady Gaga, Bruno Mars, Dolly Parton, Tony Bennett, Pat Benatar",{"$f":"IF(D27>=P9,IF(D27<P8,B27,\"\"),\"\")","v":"Paul McCartney"},", Billy Joel, **Axl Rose, Paul McCartney",{"$f":"IF(D27>=P10,IF(D27<P9,B27,\"\"),\"\")","v":""},", Bon Jovi, Tim McGraw, **Bob Dylan, Eric Clapton",{"$f":"IF(D27<P10,IF(D27=\"\",\"\",B27),\"\")","v":""},", Justin Timberlake, Elton John"]
[3,{"$f":"Data!B22","v":"**Mick Jagger"},{"$f":"IF(Teacher2Pretest!C28=\"\",\"\",Teacher2Pretest!E28)","v":0.66666666666666663},3,6,0.5,{"$f":"IF(D28>=P8,B28,\"\")","v":""},"**Justin Bieber, Taylor Swift, Beyonce Knowles, Madonna, **Kelly Clarkson, Aretha Franklin, Lady Gaga, Bruno Mars, Dolly Parton, Tony Bennett, Pat Benatar",{"$f":"IF(D28>=P9,IF(D28<P8,B28,\"\"),\"\")","v":""},", Billy Joel, **Axl Rose, Paul McCartney",{"$f":"IF(D28>=P10,IF(D28<P9,B28,\"\"),\"\")","v":"**Mick Jagger"},", Bon Jovi, Tim McGraw, **Bob Dylan, Eric Clapton, **Mick Jagger",{"$f":"IF(D28<P10,IF(D28=\"\",\"\",B28),\"\")","v":""},", Justin Timberlake, Elton John"]
["FALSE",{"$f":"Data!B23","v":"Student22"},{"$f":"IF(Teacher2Pretest!C29=\"\",\"\",Teacher2Pretest!E29)","v":""},null,"","",{"$f":"IF(D29>=P8,B29,\"\")","v":""},"**Justin Bieber, Taylor Swift, Beyonce Knowles, Madonna, **Kelly Clarkson, Aretha Franklin, Lady Gaga, Bruno Mars, Dolly Parton, Tony Bennett, Pat Benatar",{"$f":"IF(D29>=P9,IF(D29<P8,B29,\"\"),\"\")","v":""},", Billy Joel, **Axl Rose, Paul McCartney",{"$f":"IF(D29>=P10,IF(D29<P9,B29,\"\"),\"\")","v":""},", Bon Jovi, Tim McGraw, **Bob Dylan, Eric Clapton, **Mick Jagger",{"$f":"IF(D29<P10,IF(D29=\"\",\"\",B29),\"\")","v":""},", Justin Timberlake, Elton John"]
["FALSE",{"$f":"Data!B24","v":"Student23"},{"$f":"IF(Teacher2Pretest!C30=\"\",\"\",Teacher2Pretest!E30)","v":""},null,"","",{"$f":"IF(D30>=P8,B30,\"\")","v":""},"**Justin Bieber, Taylor Swift, Beyonce Knowles, Madonna, **Kelly Clarkson, Aretha Franklin, Lady Gaga, Bruno Mars, Dolly Parton, Tony Bennett, Pat Benatar",{"$f":"IF(D30>=P9,IF(D30<P8,B30,\"\"),\"\")","v":""},", Billy Joel, **Axl Rose, Paul McCartney",{"$f":"IF(D30>=P10,IF(D30<P9,B30,\"\"),\"\")","v":""},", Bon Jovi, Tim McGraw, **Bob Dylan, Eric Clapton, **Mick Jagger",{"$f":"IF(D30<P10,IF(D30=\"\",\"\",B30),\"\")","v":""},", Justin Timberlake, Elton John"]
["FALSE",{"$f":"Data!B25","v":"Student24"},{"$f":"IF(Teacher2Pretest!C31=\"\",\"\",Teacher2Pretest!E31)","v":""},null,"","",{"$f":"IF(D31>=P8,B31,\"\")","v":""},"**Justin Bieber, Taylor Swift, Beyonce Knowles, Madonna, **Kelly Clarkson, Aretha Franklin, Lady Gaga, Bruno Mars, Dolly Parton, Tony Bennett, Pat Benatar",{"$f":"IF(D31>=P9,IF(D31<P8,B31,\"\"),\"\")","v":""},", Billy Joel, **Axl Rose, Paul McCartney",{"$f":"IF(D31>=P10,IF(D31<P9,B31,\"\"),\"\")","v":""},", Bon Jovi, Tim McGraw, **Bob Dylan, Eric Clapton, **Mick Jagger",{"$f":"IF(D31<P10,IF(D31=\"\",\"\",B31),\"\")","v":""},", Justin Timberlake, Elton John"]
["FALSE",{"$f":"Data!B26","v":"Student25"},{"$f":"IF(Teacher2Pretest!C32=\"\",\"\",Teacher2Pretest!E32)","v":""},null,"","",{"$f":"IF(D32>=P8,B32,\"\")","v":""},"**Justin Bieber, Taylor Swift, Beyonce Knowles, Madonna, **Kelly Clarkson, Aretha Franklin, Lady Gaga, Bruno Mars, Dolly Parton, Tony Bennett, Pat Benatar",{"$f":"IF(D32>=P9,IF(D32<P8,B32,\"\"),\"\")","v":""},", Billy Joel, **Axl Rose, Paul McCartney",{"$f":"IF(D32>=P10,IF(D32<P9,B32,\"\"),\"\")","v":""},", Bon Jovi, Tim McGraw, **Bob Dylan, Eric Clapton, **Mick Jagger",{"$f":"IF(D32<P10,IF(D32=\"\",\"\",B32),\"\")","v":""},", Justin Timberlake, Elton John"]
["FALSE",{"$f":"Data!B27","v":"Student26"},{"$f":"IF(Teacher2Pretest!C33=\"\",\"\",Teacher2Pretest!E33)","v":""},null,"","",{"$f":"IF(D33>=P8,B33,\"\")","v":""},"**Justin Bieber, Taylor Swift, Beyonce Knowles, Madonna, **Kelly Clarkson, Aretha Franklin, Lady Gaga, Bruno Mars, Dolly Parton, Tony Bennett, Pat Benatar",{"$f":"IF(D33>=P9,IF(D33<P8,B33,\"\"),\"\")","v":""},", Billy Joel, **Axl Rose, Paul McCartney",{"$f":"IF(D33>=P10,IF(D33<P9,B33,\"\"),\"\")","v":""},", Bon Jovi, Tim McGraw, **Bob Dylan, Eric Clapton, **Mick Jagger",{"$f":"IF(D33<P10,IF(D33=\"\",\"\",B33),\"\")","v":""},", Justin Timberlake, Elton John"]
["FALSE",{"$f":"Data!B28","v":"Student27"},{"$f":"IF(Teacher2Pretest!C34=\"\",\"\",Teacher2Pretest!E34)","v":""},null,"","",{"$f":"IF(D34>=P8,B34,\"\")","v":""},"**Justin Bieber, Taylor Swift, Beyonce Knowles, Madonna, **Kelly Clarkson, Aretha Franklin, Lady Gaga, Bruno Mars, Dolly Parton, Tony Bennett, Pat Benatar",{"$f":"IF(D34>=P9,IF(D34<P8,B34,\"\"),\"\")","v":""},", Billy Joel, **Axl Rose, Paul McCartney",{"$f":"IF(D34>=P10,IF(D34<P9,B34,\"\"),\"\")","v":""},", Bon Jovi, Tim McGraw, **Bob Dylan, Eric Clapton, **Mick Jagger",{"$f":"IF(D34<P10,IF(D34=\"\",\"\",B34),\"\")","v":""},", Justin Timberlake, Elton John"]
["FALSE",{"$f":"Data!B29","v":"Student28"},{"$f":"IF(Teacher2Pretest!C35=\"\",\"\",Teacher2Pretest!E35)","v":""},null,"","",{"$f":"IF(D35>=P8,B35,\"\")","v":""},"**Justin Bieber, Taylor Swift, Beyonce Knowles, Madonna, **Kelly Clarkson, Aretha Franklin, Lady Gaga, Bruno Mars, Dolly Parton, Tony Bennett, Pat Benatar",{"$f":"IF(D35>=P9,IF(D35<P8,B35,\"\"),\"\")","v":""},", Billy Joel, **Axl Rose, Paul McCartney",{"$f":"IF(D35>=P10,IF(D35<P9,B35,\"\"),\"\")","v":""},", Bon Jovi, Tim McGraw, **Bob Dylan, Eric Clapton, **Mick Jagger",{"$f":"IF(D35<P10,IF(D35=\"\",\"\",B35),\"\")","v":""},", Justin Timberlake, Elton John"]
["FALSE",{"$f":"Data!B30","v":"Student29"},{"$f":"IF(Teacher2Pretest!C36=\"\",\"\",Teacher2Pretest!E36)","v":""},null,"","",{"$f":"IF(D36>=P8,B36,\"\")","v":""},"**Justin Bieber, Taylor Swift, Beyonce Knowles, Madonna, **Kelly Clarkson, Aretha Franklin, Lady Gaga, Bruno Mars, Dolly Parton, Tony Bennett, Pat Benatar",{"$f":"IF(D36>=P9,IF(D36<P8,B36,\"\"),\"\")","v":""},", Billy Joel, **Axl Rose, Paul McCartney",{"$f":"IF(D36>=P10,IF(D36<P9,B36,\"\"),\"\")","v":""},", Bon Jovi, Tim McGraw, **Bob Dylan, Eric Clapton, **Mick Jagger",{"$f":"IF(D36<P10,IF(D36=\"\",\"\",B36),\"\")","v":""},", Justin Timberlake, Elton John"]
["FALSE",{"$f":"Data!B31","v":"Student30"},{"$f":"IF(Teacher2Pretest!C37=\"\",\"\",Teacher2Pretest!E37)","v":""},null,"","",{"$f":"IF(D37>=P8,B37,\"\")","v":""},"**Justin Bieber, Taylor Swift, Beyonce Knowles, Madonna, **Kelly Clarkson, Aretha Franklin, Lady Gaga, Bruno Mars, Dolly Parton, Tony Bennett, Pat Benatar",{"$f":"IF(D37>=P9,IF(D37<P8,B37,\"\"),\"\")","v":""},", Billy Joel, **Axl Rose, Paul McCartney",{"$f":"IF(D37>=P10,IF(D37<P9,B37,\"\"),\"\")","v":""},", Bon Jovi, Tim McGraw, **Bob Dylan, Eric Clapton, **Mick Jagger",{"$f":"IF(D37<P10,IF(D37=\"\",\"\",B37),\"\")","v":""},", Justin Timberlake, Elton John"]
["FALSE"]
[null,"TOTAL",null,{"$f":"SUM(D8:D37)","v":85},{"$f":"SUM(E8:E37)","v":126},{"$f":"D39/E39","v":0.67460317460317465}]

{"sheet":"Teacher3Post","index":17,"n_rows":39,"n_cols":17,"rows_kept":39,"cut":false,"hidden":false,"merged":[[4,1,6,1],[4,3,6,3],[4,4,5,4],[4,5,6,5],[0,1,0,3],[0,4,0,5],[1,1,1,3],[1,4,1,5],[2,1,3,3],[2,4,3,5],[4,2,6,2]]}
[null,{"$f":"IF(Data!N6=\"Other\",Data!N7,Data!N6)","v":"Grade 4"},null,null,{"$f":"Data!C1","v":"Gibson"}]
[null,"Meeting Date:",null,null,{"$f":"Data!O8","v":"3/20/14"}]
[null,"Assessment:",null,null,{"$f":"Teacher1Pretest!D3","v":"Main Idea- R.I.4.2"}]
[]
[null,"Student Name","Pretest %","Post-test Points","Possible","Score - %"]
[]
[null,null,null,null,{"$f":"Teacher1Post!P7","v":6},null,"Proficient",null,"Close",null,"Far",null,"Intervention",null,null,{"$f":"Data!O10","v":6},"Points Possible on Post-Test"]
[{"$f":"IF(ISBLANK(D8),\"FALSE\",IF(LEFT(B8,2)=\"**\",IF(D8>=$P$8,$P$8,IF(D8>=$P$9,$P$9,IF(D8>=$P$10,$P$10,$P$11)))))","v":5},{"$f":"Data!C2","v":"**Albert Einstein"},{"$f":"IF(Teacher3Pretest!C8=\"\",\"\",Teacher3Pretest!E8)","v":0.66666666666666663},5,{"$f":"IF(D8=\"\",\"\",$E$7)","v":6},{"$f":"IF(E8=\"\",\"\",D8/$E$7)","v":0.83333333333333337},{"$f":"IF(D8>=P8,B8,\"\")","v":"**Albert Einstein"},{"$f":"G8","v":"**Albert Einstein"},{"$f":"IF(D8>=P9,IF(D8<P8,B8,\"\"),\"\")","v":""},{"$f":"I8","v":""},{"$f":"IF(D8>=P10,IF(D8<P9,B8,\"\"),\"\")","v":""},{"$f":"K8","v":""},{"$f":"IF(D8<P10,IF(D8=\"\",\"\",B8),\"\")","v":""},{"$f":"M8","v":""},null,{"$f":"Data!O11","v":5},"Proficient"]
[{"$f":"IF(ISBLANK(D9),\"FALSE\",IF(LEFT(B9,2)=\"**\",IF(D9>=$P$8,$P$8,IF(D9>=$P$9,$P$9,IF(D9>=$P$10,$P$10,$P$11)))))","v":false},{"$f":"Data!C3","v":"Alfred Nobel"},{"$f":"IF(Teacher3Pretest!C9=\"\",\"\",Teacher3Pretest!E9)","v":0.16666666666666666},4,{"$f":"IF(D9=\"\",\"\",$E$7)","v":6},{"$f":"IF(E9=\"\",\"\",D9/$E$7)","v":0.66666666666666663},{"$f":"IF(D9>=P8,B9,\"\")","v":""},{"$f":"H8&IF(G9=\"\",\"\",\", \")&G9","v":"**Albert Einstein"},{"$f":"IF(D9>=P9,IF(D9<P8,B9,\"\"),\"\")","v":"Alfred Nobel"},{"$f":"J8&IF(I9=\"\",\"\",\", \")&I9","v":", Alfred Nobel"},{"$f":"IF(D9>=P10,IF(D9<P9,B9,\"\"),\"\")","v":""},{"$f":"L8&IF(K9=\"\",\"\",\", \")&K9","v":""},{"$f":"IF(D9<P10,IF(D9=\"\",\"\",B9),\"\")","v":""},{"$f":"N8&IF(M9=\"\",\"\",\", \")&M9","v":""},null,{"$f":"Data!O12","v":4},"Close to Proficient"]
[false,{"$f":"Data!C4","v":"Benjamin Franklin"},{"$f":"IF(Teacher3Pretest!C10=\"\",\"\",Teacher3Pretest!E10)","v":0.66666666666666663},3,6,0.5,{"$f":"IF(D10>=P8,B10,\"\")","v":""},{"$f":"H9&IF(G10=\"\",\"\",\", \")&G10","v":"**Albert Einstein"},{"$f":"IF(D10>=P9,IF(D10<P8,B10,\"\"),\"\")","v":""},{"$f":"J9&IF(I10=\"\",\"\",\", \")&I10","v":", Alfred Nobel"},{"$f":"IF(D10>=P10,IF(D10<P9,B10,\"\"),\"\")","v":"Benjamin Franklin"},{"$f":"L9&IF(K10=\"\",\"\",\", \")&K10","v":", Benjamin Franklin"},{"$f":"IF(D10<P10,IF(D10=\"\",\"\",B10),\"\")","v":""},{"$f":"N9&IF(M10=\"\",\"\",\", \")&M10","v":""},null,{"$f":"Data!O13","v":3},"Far to Go But Likely to Become Proficient"]
[false,{"$f":"Data!C5","v":"Carl Sagan*"},{"$f":"IF(Teacher3Pretest!C11=\"\",\"\",Teacher3Pretest!E11)","v":0.83333333333333337},5,6,0.83333333333333337,{"$f":"IF(D11>=P8,B11,\"\")","v":"Carl Sagan*"},"**Albert Einstein, Carl Sagan*",{"$f":"IF(D11>=P9,IF(D11<P8,B11,\"\"),\"\")","v":""},", Alfred Nobel",{"$f":"IF(D11>=P10,IF(D11<P9,B11,\"\"),\"\")","v":""},", Benjamin Franklin",{"$f":"IF(D11<P10,IF(D11=\"\",\"\",B11),\"\")","v":""},"",null,{"$f":"Data!O14","v":1},"Intervention (Far to Go But Not Likely to Become Proficient)"]
[false,{"$f":"Data!C6","v":"Charles Darwin"},{"$f":"IF(Teacher3Pretest!C12=\"\",\"\",Teacher3Pretest!E12)","v":0.33333333333333331},4,6,0.66666666666666663,{"$f":"IF(D12>=P8,B12,\"\")","v":""},"**Albert Einstein, Carl Sagan*",{"$f":"IF(D12>=P9,IF(D12<P8,B12,\"\"),\"\")","v":"Charles Darwin"},", Alfred Nobel, Charles Darwin",{"$f":"IF(D12>=P10,IF(D12<P9,B12,\"\"),\"\")","v":""},", Benjamin Franklin",{"$f":"IF(D12<P10,IF(D12=\"\",\"\",B12),\"\")","v":""},""]
[false,{"$f":"Data!C7","v":"Henry Ford"},{"$f":"IF(Teacher3Pretest!C13=\"\",\"\",Teacher3Pretest!E13)","v":0.5},5,6,0.83333333333333337,{"$f":"IF(D13>=P8,B13,\"\")","v":"Henry Ford"},"**Albert Einstein, Carl Sagan*, Henry Ford",{"$f":"IF(D13>=P9,IF(D13<P8,B13,\"\"),\"\")","v":""},", Alfred Nobel, Charles Darwin",{"$f":"IF(D13>=P10,IF(D13<P9,B13,\"\"),\"\")","v":""},", Benjamin Franklin",{"$f":"IF(D13<P10,IF(D13=\"\",\"\",B13),\"\")","v":""},""]
[1,{"$f":"Data!C8","v":"**Isaac Newton"},{"$f":"IF(Teacher3Pretest!C14=\"\",\"\",Teacher3Pretest!E14)","v":0.33333333333333331},2,6,0.33333333333333331,{"$f":"IF(D14>=P8,B14,\"\")","v":""},"**Albert Einstein, Carl Sagan*, Henry Ford",{"$f":"IF(D14>=P9,IF(D14<P8,B14,\"\"),\"\")","v":""},", Alfred Nobel, Charles Darwin",{"$f":"IF(D14>=P10,IF(D14<P9,B14,\"\"),\"\")","v":""},", Benjamin Franklin",{"$f":"IF(D14<P10,IF(D14=\"\",\"\",B14),\"\")","v":"**Isaac Newton"},", **Isaac Newton"]
[false,{"$f":"Data!C9","v":"Ivan Pavlov"},{"$f":"IF(Teacher3Pretest!C15=\"\",\"\",Teacher3Pretest!E15)","v":0.33333333333333331},5,6,0.83333333333333337,{"$f":"IF(D15>=P8,B15,\"\")","v":"Ivan Pavlov"},"**Albert Einstein, Carl Sagan*, Henry Ford, Ivan Pavlov",{"$f":"IF(D15>=P9,IF(D15<P8,B15,\"\"),\"\")","v":""},", Alfred Nobel, Charles Darwin",{"$f":"IF(D15>=P10,IF(D15<P9,B15,\"\"),\"\")","v":""},", Benjamin Franklin",{"$f":"IF(D15<P10,IF(D15=\"\",\"\",B15),\"\")","v":""},", **Isaac Newton"]
[false,{"$f":"Data!C10","v":"Jane Goodall"},{"$f":"IF(Teacher3Pretest!C16=\"\",\"\",Teacher3Pretest!E16)","v":0.33333333333333331},3,6,0.5,{"$f":"IF(D16>=P8,B16,\"\")","v":""},"**Albert Einstein, Carl Sagan*, Henry Ford, Ivan Pavlov",{"$f":"IF(D16>=P9,IF(D16<P8,B16,\"\"),\"\")","v":""},", Alfred Nobel, Charles Darwin",{"$f":"IF(D16>=P10,IF(D16<P9,B16,\"\"),\"\")","v":"Jane Goodall"},", Benjamin Franklin, Jane Goodall",{"$f":"IF(D16<P10,IF(D16=\"\",\"\",B16),\"\")","v":""},", **Isaac Newton"]
[false,{"$f":"Data!C11","v":"Jean Piaget"},{"$f":"IF(Teacher3Pretest!C17=\"\",\"\",Teacher3Pretest!E17)","v":0.33333333333333331},2,6,0.33333333333333331,{"$f":"IF(D17>=P8,B17,\"\")","v":""},"**Albert Einstein, Carl Sagan*, Henry Ford, Ivan Pavlov",{"$f":"IF(D17>=P9,IF(D17<P8,B17,\"\"),\"\")","v":""},", Alfred Nobel, Charles Darwin",{"$f":"IF(D17>=P10,IF(D17<P9,B17,\"\"),\"\")","v":""},", Benjamin Franklin, Jane Goodall",{"$f":"IF(D17<P10,IF(D17=\"\",\"\",B17),\"\")","v":"Jean Piaget"},", **Isaac Newton, Jean Piaget"]
[5,{"$f":"Data!C12","v":"**Jonas Salk"},{"$f":"IF(Teacher3Pretest!C18=\"\",\"\",Teacher3Pretest!E18)","v":0.16666666666666666},5,6,0.83333333333333337,{"$f":"IF(D18>=P8,B18,\"\")","v":"**Jonas Salk"},"**Albert Einstein, Carl Sagan*, Henry Ford, Ivan Pavlov, **Jonas Salk",{"$f":"IF(D18>=P9,IF(D18<P8,B18,\"\"),\"\")","v":""},", Alfred Nobel, Charles Darwin",{"$f":"IF(D18>=P10,IF(D18<P9,B18,\"\"),\"\")","v":""},", Benjamin Franklin, Jane Goodall",{"$f":"IF(D18<P10,IF(D18=\"\",\"\",B18),\"\")","v":""},", **Isaac Newton, Jean Piaget"]
[5,{"$f":"Data!C13","v":"**Marie Curie"},{"$f":"IF(Teacher3Pretest!C19=\"\",\"\",Teacher3Pretest!E19)","v":0.83333333333333337},5,6,0.83333333333333337,{"$f":"IF(D19>=P8,B19,\"\")","v":"**Marie Curie"},"**Albert Einstein, Carl Sagan*, Henry Ford, Ivan Pavlov, **Jonas Salk, **Marie Curie",{"$f":"IF(D19>=P9,IF(D19<P8,B19,\"\"),\"\")","v":""},", Alfred Nobel, Charles Darwin",{"$f":"IF(D19>=P10,IF(D19<P9,B19,\"\"),\"\")","v":""},", Benjamin Franklin, Jane Goodall",{"$f":"IF(D19<P10,IF(D19=\"\",\"\",B19),\"\")","v":""},", **Isaac Newton, Jean Piaget"]
[false,{"$f":"Data!C14","v":"Sigmund Freud"},{"$f":"IF(Teacher3Pretest!C20=\"\",\"\",Teacher3Pretest!E20)","v":1},6,6,1,{"$f":"IF(D20>=P8,B20,\"\")","v":"Sigmund Freud"},"**Albert Einstein, Carl Sagan*, Henry Ford, Ivan Pavlov, **Jonas Salk, **Marie Curie, Sigmund Freud",{"$f":"IF(D20>=P9,IF(D20<P8,B20,\"\"),\"\")","v":""},", Alfred Nobel, Charles Darwin",{"$f":"IF(D20>=P10,IF(D20<P9,B20,\"\"),\"\")","v":""},", Benjamin Franklin, Jane Goodall",{"$f":"IF(D20<P10,IF(D20=\"\",\"\",B20),\"\")","v":""},", **Isaac Newton, Jean Piaget"]
[false,{"$f":"Data!C15","v":"Stephen Hawking"},{"$f":"IF(Teacher3Pretest!C21=\"\",\"\",Teacher3Pretest!E21)","v":0.83333333333333337},6,6,1,{"$f":"IF(D21>=P8,B21,\"\")","v":"Stephen Hawking"},"**Albert Einstein, Carl Sagan*, Henry Ford, Ivan Pavlov, **Jonas Salk, **Marie Curie, Sigmund Freud, Stephen Hawking",{"$f":"IF(D21>=P9,IF(D21<P8,B21,\"\"),\"\")","v":""},", Alfred Nobel, Charles Darwin",{"$f":"IF(D21>=P10,IF(D21<P9,B21,\"\"),\"\")","v":""},", Benjamin Franklin, Jane Goodall",{"$f":"IF(D21<P10,IF(D21=\"\",\"\",B21),\"\")","v":""},", **Isaac Newton, Jean Piaget"]
[false,{"$f":"Data!C16","v":"Thomas Edison"},{"$f":"IF(Teacher3Pretest!C22=\"\",\"\",Teacher3Pretest!E22)","v":0.33333333333333331},6,6,1,{"$f":"IF(D22>=P8,B22,\"\")","v":"Thomas Edison"},"**Albert Einstein, Carl Sagan*, Henry Ford, Ivan Pavlov, **Jonas Salk, **Marie Curie, Sigmund Freud, Stephen Hawking, Thomas Edison",{"$f":"IF(D22>=P9,IF(D22<P8,B22,\"\"),\"\")","v":""},", Alfred Nobel, Charles Darwin",{"$f":"IF(D22>=P10,IF(D22<P9,B22,\"\"),\"\")","v":""},", Benjamin Franklin, Jane Goodall",{"$f":"IF(D22<P10,IF(D22=\"\",\"\",B22),\"\")","v":""},", **Isaac Newton, Jean Piaget"]
[false,{"$f":"Data!C17","v":"John Dewey"},{"$f":"IF(Teacher3Pretest!C23=\"\",\"\",Teacher3Pretest!E23)","v":0.66666666666666663},4,6,0.66666666666666663,{"$f":"IF(D23>=P8,B23,\"\")","v":""},"**Albert Einstein, Carl Sagan*, Henry Ford, Ivan Pavlov, **Jonas Salk, **Marie Curie, Sigmund Freud, Stephen Hawking, Thomas Edison",{"$f":"IF(D23>=P9,IF(D23<P8,B23,\"\"),\"\")","v":"John Dewey"},", Alfred Nobel, Charles Darwin, John Dewey",{"$f":"IF(D23>=P10,IF(D23<P9,B23,\"\"),\"\")","v":""},", Benjamin Franklin, Jane Goodall",{"$f":"IF(D23<P10,IF(D23=\"\",\"\",B23),\"\")","v":""},", **Isaac Newton, Jean Piaget"]
[4,{"$f":"Data!C18","v":"**B.F. Skinner"},{"$f":"IF(Teacher3Pretest!C24=\"\",\"\",Teacher3Pretest!E24)","v":0.66666666666666663},4,6,0.66666666666666663,{"$f":"IF(D24>=P8,B24,\"\")","v":""},"**Albert Einstein, Carl Sagan*, Henry Ford, Ivan Pavlov, **Jonas Salk, **Marie Curie, Sigmund Freud, Stephen Hawking, Thomas Edison",{"$f":"IF(D24>=P9,IF(D24<P8,B24,\"\"),\"\")","v":"**B.F. Skinner"},", Alfred Nobel, Charles Darwin, John Dewey, **B.F. Skinner",{"$f":"IF(D24>=P10,IF(D24<P9,B24,\"\"),\"\")","v":""},", Benjamin Franklin, Jane Goodall",{"$f":"IF(D24<P10,IF(D24=\"\",\"\",B24),\"\")","v":""},", **Isaac Newton, Jean Piaget"]
[false,{"$f":"Data!C19","v":"Howard Gardner"},{"$f":"IF(Teacher3Pretest!C25=\"\",\"\",Teacher3Pretest!E25)","v":0.83333333333333337},5,6,0.83333333333333337,{"$f":"IF(D25>=P8,B25,\"\")","v":"Howard Gardner"},"**Albert Einstein, Carl Sagan*, Henry Ford, Ivan Pavlov, **Jonas Salk, **Marie Curie, Sigmund Freud, Stephen Hawking, Thomas Edison, Howard Gardner",{"$f":"IF(D25>=P9,IF(D25<P8,B25,\"\"),\"\")","v":""},", Alfred Nobel, Charles Darwin, John Dewey, **B.F. Skinner",{"$f":"IF(D25>=P10,IF(D25<P9,B25,\"\"),\"\")","v":""},", Benjamin Franklin, Jane Goodall",{"$f":"IF(D25<P10,IF(D25=\"\",\"\",B25),\"\")","v":""},", **Isaac Newton, Jean Piaget"]
[false,{"$f":"Data!C20","v":"Lev Vygotsky"},{"$f":"IF(Teacher3Pretest!C26=\"\",\"\",Teacher3Pretest!E26)","v":0.66666666666666663},5,6,0.83333333333333337,{"$f":"IF(D26>=P8,B26,\"\")","v":"Lev Vygotsky"},"**Albert Einstein, Carl Sagan*, Henry Ford, Ivan Pavlov, **Jonas Salk, **Marie Curie, Sigmund Freud, Stephen Hawking, Thomas Edison, Howard Gardner, Lev Vygotsky",{"$f":"IF(D26>=P9,IF(D26<P8,B26,\"\"),\"\")","v":""},", Alfred Nobel, Charles Darwin, John Dewey, **B.F. Skinner",{"$f":"IF(D26>=P10,IF(D26<P9,B26,\"\"),\"\")","v":""},", Benjamin Franklin, Jane Goodall",{"$f":"IF(D26<P10,IF(D26=\"\",\"\",B26),\"\")","v":""},", **Isaac Newton, Jean Piaget"]
[false,{"$f":"Data!C21","v":"Maria Montessori"},{"$f":"IF(Teacher3Pretest!C27=\"\",\"\",Teacher3Pretest!E27)","v":0.5},5,6,0.83333333333333337,{"$f":"IF(D27>=P8,B27,\"\")","v":"Maria Montessori"},"**Albert Einstein, Carl Sagan*, Henry Ford, Ivan Pavlov, **Jonas Salk, **Marie Curie, Sigmund Freud, Stephen Hawking, Thomas Edison, Howard Gardner, Lev Vygotsky, Maria Montessori",{"$f":"IF(D27>=P9,IF(D27<P8,B27,\"\"),\"\")","v":""},", Alfred Nobel, Charles Darwin, John Dewey, **B.F. Skinner",{"$f":"IF(D27>=P10,IF(D27<P9,B27,\"\"),\"\")","v":""},", Benjamin Franklin, Jane Goodall",{"$f":"IF(D27<P10,IF(D27=\"\",\"\",B27),\"\")","v":""},", **Isaac Newton, Jean Piaget"]
["FALSE",{"$f":"Data!C22","v":"Student21"},{"$f":"IF(Teacher3Pretest!C28=\"\",\"\",Teacher3Pretest!E28)","v":""},null,"","",{"$f":"IF(D28>=P8,B28,\"\")","v":""},"**Albert Einstein, Carl Sagan*, Henry Ford, Ivan Pavlov, **Jonas Salk, **Marie Curie, Sigmund Freud, Stephen Hawking, Thomas Edison, Howard Gardner, Lev Vygotsky, Maria Montessori",{"$f":"IF(D28>=P9,IF(D28<P8,B28,\"\"),\"\")","v":""},", Alfred Nobel, Charles Darwin, John Dewey, **B.F. Skinner",{"$f":"IF(D28>=P10,IF(D28<P9,B28,\"\"),\"\")","v":""},", Benjamin Franklin, Jane Goodall",{"$f":"IF(D28<P10,IF(D28=\"\",\"\",B28),\"\")","v":""},", **Isaac Newton, Jean Piaget"]
["FALSE",{"$f":"Data!C23","v":"Student22"},{"$f":"IF(Teacher3Pretest!C29=\"\",\"\",Teacher3Pretest!E29)","v":""},null,"","",{"$f":"IF(D29>=P8,B29,\"\")","v":""},"**Albert Einstein, Carl Sagan*, Henry Ford, Ivan Pavlov, **Jonas Salk, **Marie Curie, Sigmund Freud, Stephen Hawking, Thomas Edison, Howard Gardner, Lev Vygotsky, Maria Montessori",{"$f":"IF(D29>=P9,IF(D29<P8,B29,\"\"),\"\")","v":""},", Alfred Nobel, Charles Darwin, John Dewey, **B.F. Skinner",{"$f":"IF(D29>=P10,IF(D29<P9,B29,\"\"),\"\")","v":""},", Benjamin Franklin, Jane Goodall",{"$f":"IF(D29<P10,IF(D29=\"\",\"\",B29),\"\")","v":""},", **Isaac Newton, Jean Piaget"]
["FALSE",{"$f":"Data!C24","v":"Student23"},{"$f":"IF(Teacher3Pretest!C30=\"\",\"\",Teacher3Pretest!E30)","v":""},null,"","",{"$f":"IF(D30>=P8,B30,\"\")","v":""},"**Albert Einstein, Carl Sagan*, Henry Ford, Ivan Pavlov, **Jonas Salk, **Marie Curie, Sigmund Freud, Stephen Hawking, Thomas Edison, Howard Gardner, Lev Vygotsky, Maria Montessori",{"$f":"IF(D30>=P9,IF(D30<P8,B30,\"\"),\"\")","v":""},", Alfred Nobel, Charles Darwin, John Dewey, **B.F. Skinner",{"$f":"IF(D30>=P10,IF(D30<P9,B30,\"\"),\"\")","v":""},", Benjamin Franklin, Jane Goodall",{"$f":"IF(D30<P10,IF(D30=\"\",\"\",B30),\"\")","v":""},", **Isaac Newton, Jean Piaget"]
["FALSE",{"$f":"Data!C25","v":"Student24"},{"$f":"IF(Teacher3Pretest!C31=\"\",\"\",Teacher3Pretest!E31)","v":""},null,"","",{"$f":"IF(D31>=P8,B31,\"\")","v":""},"**Albert Einstein, Carl Sagan*, Henry Ford, Ivan Pavlov, **Jonas Salk, **Marie Curie, Sigmund Freud, Stephen Hawking, Thomas Edison, Howard Gardner, Lev Vygotsky, Maria Montessori",{"$f":"IF(D31>=P9,IF(D31<P8,B31,\"\"),\"\")","v":""},", Alfred Nobel, Charles Darwin, John Dewey, **B.F. Skinner",{"$f":"IF(D31>=P10,IF(D31<P9,B31,\"\"),\"\")","v":""},", Benjamin Franklin, Jane Goodall",{"$f":"IF(D31<P10,IF(D31=\"\",\"\",B31),\"\")","v":""},", **Isaac Newton, Jean Piaget"]
["FALSE",{"$f":"Data!C26","v":"Student25"},{"$f":"IF(Teacher3Pretest!C32=\"\",\"\",Teacher3Pretest!E32)","v":""},null,"","",{"$f":"IF(D32>=P8,B32,\"\")","v":""},"**Albert Einstein, Carl Sagan*, Henry Ford, Ivan Pavlov, **Jonas Salk, **Marie Curie, Sigmund Freud, Stephen Hawking, Thomas Edison, Howard Gardner, Lev Vygotsky, Maria Montessori",{"$f":"IF(D32>=P9,IF(D32<P8,B32,\"\"),\"\")","v":""},", Alfred Nobel, Charles Darwin, John Dewey, **B.F. Skinner",{"$f":"IF(D32>=P10,IF(D32<P9,B32,\"\"),\"\")","v":""},", Benjamin Franklin, Jane Goodall",{"$f":"IF(D32<P10,IF(D32=\"\",\"\",B32),\"\")","v":""},", **Isaac Newton, Jean Piaget"]
["FALSE",{"$f":"Data!C27","v":"Student26"},{"$f":"IF(Teacher3Pretest!C33=\"\",\"\",Teacher3Pretest!E33)","v":""},null,"","",{"$f":"IF(D33>=P8,B33,\"\")","v":""},"**Albert Einstein, Carl Sagan*, Henry Ford, Ivan Pavlov, **Jonas Salk, **Marie Curie, Sigmund Freud, Stephen Hawking, Thomas Edison, Howard Gardner, Lev Vygotsky, Maria Montessori",{"$f":"IF(D33>=P9,IF(D33<P8,B33,\"\"),\"\")","v":""},", Alfred Nobel, Charles Darwin, John Dewey, **B.F. Skinner",{"$f":"IF(D33>=P10,IF(D33<P9,B33,\"\"),\"\")","v":""},", Benjamin Franklin, Jane Goodall",{"$f":"IF(D33<P10,IF(D33=\"\",\"\",B33),\"\")","v":""},", **Isaac Newton, Jean Piaget"]
["FALSE",{"$f":"Data!C28","v":"Student27"},{"$f":"IF(Teacher3Pretest!C34=\"\",\"\",Teacher3Pretest!E34)","v":""},null,"","",{"$f":"IF(D34>=P8,B34,\"\")","v":""},"**Albert Einstein, Carl Sagan*, Henry Ford, Ivan Pavlov, **Jonas Salk, **Marie Curie, Sigmund Freud, Stephen Hawking, Thomas Edison, Howard Gardner, Lev Vygotsky, Maria Montessori",{"$f":"IF(D34>=P9,IF(D34<P8,B34,\"\"),\"\")","v":""},", Alfred Nobel, Charles Darwin, John Dewey, **B.F. Skinner",{"$f":"IF(D34>=P10,IF(D34<P9,B34,\"\"),\"\")","v":""},", Benjamin Franklin, Jane Goodall",{"$f":"IF(D34<P10,IF(D34=\"\",\"\",B34),\"\")","v":""},", **Isaac Newton, Jean Piaget"]
["FALSE",{"$f":"Data!C29","v":"Student28"},{"$f":"IF(Teacher3Pretest!C35=\"\",\"\",Teacher3Pretest!E35)","v":""},null,"","",{"$f":"IF(D35>=P8,B35,\"\")","v":""},"**Albert Einstein, Carl Sagan*, Henry Ford, Ivan Pavlov, **Jonas Salk, **Marie Curie, Sigmund Freud, Stephen Hawking, Thomas Edison, Howard Gardner, Lev Vygotsky, Maria Montessori",{"$f":"IF(D35>=P9,IF(D35<P8,B35,\"\"),\"\")","v":""},", Alfred Nobel, Charles Darwin, John Dewey, **B.F. Skinner",{"$f":"IF(D35>=P10,IF(D35<P9,B35,\"\"),\"\")","v":""},", Benjamin Franklin, Jane Goodall",{"$f":"IF(D35<P10,IF(D35=\"\",\"\",B35),\"\")","v":""},", **Isaac Newton, Jean Piaget"]
["FALSE",{"$f":"Data!C30","v":"Student29"},{"$f":"IF(Teacher3Pretest!C36=\"\",\"\",Teacher3Pretest!E36)","v":""},null,"","",{"$f":"IF(D36>=P8,B36,\"\")","v":""},"**Albert Einstein, Carl Sagan*, Henry Ford, Ivan Pavlov, **Jonas Salk, **Marie Curie, Sigmund Freud, Stephen Hawking, Thomas Edison, Howard Gardner, Lev Vygotsky, Maria Montessori",{"$f":"IF(D36>=P9,IF(D36<P8,B36,\"\"),\"\")","v":""},", Alfred Nobel, Charles Darwin, John Dewey, **B.F. Skinner",{"$f":"IF(D36>=P10,IF(D36<P9,B36,\"\"),\"\")","v":""},", Benjamin Franklin, Jane Goodall",{"$f":"IF(D36<P10,IF(D36=\"\",\"\",B36),\"\")","v":""},", **Isaac Newton, Jean Piaget"]
["FALSE",{"$f":"Data!C31","v":"Student30"},{"$f":"IF(Teacher3Pretest!C37=\"\",\"\",Teacher3Pretest!E37)","v":""},null,"","",{"$f":"IF(D37>=P8,B37,\"\")","v":""},"**Albert Einstein, Carl Sagan*, Henry Ford, Ivan Pavlov, **Jonas Salk, **Marie Curie, Sigmund Freud, Stephen Hawking, Thomas Edison, Howard Gardner, Lev Vygotsky, Maria Montessori",{"$f":"IF(D37>=P9,IF(D37<P8,B37,\"\"),\"\")","v":""},", Alfred Nobel, Charles Darwin, John Dewey, **B.F. Skinner",{"$f":"IF(D37>=P10,IF(D37<P9,B37,\"\"),\"\")","v":""},", Benjamin Franklin, Jane Goodall",{"$f":"IF(D37<P10,IF(D37=\"\",\"\",B37),\"\")","v":""},", **Isaac Newton, Jean Piaget"]
["FALSE"]
[null,"TOTAL",null,{"$f":"SUM(D8:D37)","v":89},{"$f":"SUM(E8:E37)","v":120},{"$f":"D39/E39","v":0.7416666666666667}]

{"sheet":"Teacher4Post","index":18,"n_rows":39,"n_cols":17,"rows_kept":39,"cut":false,"hidden":false,"merged":[[4,1,6,1],[4,3,6,3],[4,4,5,4],[4,5,6,5],[0,1,0,3],[0,4,0,5],[1,1,1,3],[1,4,1,5],[2,1,3,3],[2,4,3,5],[4,2,6,2]]}
[null,{"$f":"IF(Data!N6=\"Other\",Data!N7,Data!N6)","v":"Grade 4"},null,null,{"$f":"Data!D1","v":"Smith"}]
[null,"Meeting Date:",null,null,{"$f":"Data!O8","v":"3/20/14"}]
[null,"Assessment:",null,null,{"$f":"Teacher1Pretest!D3","v":"Main Idea- R.I.4.2"}]
[]
[null,"Student Name","Pretest %","Post-test Points","Possible","Score - %"]
[]
[null,null,null,null,{"$f":"Teacher1Post!P7","v":6},null,"Proficient",null,"Close",null,"Far",null,"Intervention",null,null,{"$f":"Data!O10","v":6},"Points Possible on Post-Test"]
[{"$f":"IF(ISBLANK(D8),\"FALSE\",IF(LEFT(B8,2)=\"**\",IF(D8>=$P$8,$P$8,IF(D8>=$P$9,$P$9,IF(D8>=$P$10,$P$10,$P$11)))))","v":false},{"$f":"Data!D2","v":"Michael Jordan"},{"$f":"IF(Teacher4Pretest!C8=\"\",\"\",Teacher4Pretest!E8)","v":0.66666666666666663},5,{"$f":"IF(D8=\"\",\"\",$E$7)","v":6},{"$f":"IF(E8=\"\",\"\",D8/$E$7)","v":0.83333333333333337},{"$f":"IF(D8>=P8,B8,\"\")","v":"Michael Jordan"},{"$f":"G8","v":"Michael Jordan"},{"$f":"IF(D8>=P9,IF(D8<P8,B8,\"\"),\"\")","v":""},{"$f":"I8","v":""},{"$f":"IF(D8>=P10,IF(D8<P9,B8,\"\"),\"\")","v":""},{"$f":"K8","v":""},{"$f":"IF(D8<P10,IF(D8=\"\",\"\",B8),\"\")","v":""},{"$f":"M8","v":""},null,{"$f":"Data!O11","v":5},"Proficient"]
[{"$f":"IF(ISBLANK(D9),\"FALSE\",IF(LEFT(B9,2)=\"**\",IF(D9>=$P$8,$P$8,IF(D9>=$P$9,$P$9,IF(D9>=$P$10,$P$10,$P$11)))))","v":false},{"$f":"Data!D3","v":"Muhammad Ali"},{"$f":"IF(Teacher4Pretest!C9=\"\",\"\",Teacher4Pretest!E9)","v":0.66666666666666663},5,{"$f":"IF(D9=\"\",\"\",$E$7)","v":6},{"$f":"IF(E9=\"\",\"\",D9/$E$7)","v":0.83333333333333337},{"$f":"IF(D9>=P8,B9,\"\")","v":"Muhammad Ali"},{"$f":"H8&IF(G9=\"\",\"\",\", \")&G9","v":"Michael Jordan, Muhammad Ali"},{"$f":"IF(D9>=P9,IF(D9<P8,B9,\"\"),\"\")","v":""},{"$f":"J8&IF(I9=\"\",\"\",\", \")&I9","v":""},{"$f":"IF(D9>=P10,IF(D9<P9,B9,\"\"),\"\")","v":""},{"$f":"L8&IF(K9=\"\",\"\",\", \")&K9","v":""},{"$f":"IF(D9<P10,IF(D9=\"\",\"\",B9),\"\")","v":""},{"$f":"N8&IF(M9=\"\",\"\",\", \")&M9","v":""},null,{"$f":"Data!O12","v":4},"Close to Proficient"]
[false,{"$f":"Data!D4","v":"Roger Federer"},{"$f":"IF(Teacher4Pretest!C10=\"\",\"\",Teacher4Pretest!E10)","v":0.16666666666666666},4,6,0.66666666666666663,{"$f":"IF(D10>=P8,B10,\"\")","v":""},{"$f":"H9&IF(G10=\"\",\"\",\", \")&G10","v":"Michael Jordan, Muhammad Ali"},{"$f":"IF(D10>=P9,IF(D10<P8,B10,\"\"),\"\")","v":"Roger Federer"},{"$f":"J9&IF(I10=\"\",\"\",\", \")&I10","v":", Roger Federer"},{"$f":"IF(D10>=P10,IF(D10<P9,B10,\"\"),\"\")","v":""},{"$f":"L9&IF(K10=\"\",\"\",\", \")&K10","v":""},{"$f":"IF(D10<P10,IF(D10=\"\",\"\",B10),\"\")","v":""},{"$f":"N9&IF(M10=\"\",\"\",\", \")&M10","v":""},null,{"$f":"Data!O13","v":3},"Far to Go But Likely to Become Proficient"]
[1,{"$f":"Data!D5","v":"**Michael Phelps"},{"$f":"IF(Teacher4Pretest!C11=\"\",\"\",Teacher4Pretest!E11)","v":0.83333333333333337},2,6,0.33333333333333331,{"$f":"IF(D11>=P8,B11,\"\")","v":""},"Michael Jordan, Muhammad Ali",{"$f":"IF(D11>=P9,IF(D11<P8,B11,\"\"),\"\")","v":""},", Roger Federer",{"$f":"IF(D11>=P10,IF(D11<P9,B11,\"\"),\"\")","v":""},"",{"$f":"IF(D11<P10,IF(D11=\"\",\"\",B11),\"\")","v":"**Michael Phelps"},", **Michael Phelps",null,{"$f":"Data!O14","v":1},"Intervention (Far to Go But Not Likely to Become Proficient)"]
[false,{"$f":"Data!D6","v":"Wayne Gretzky"},{"$f":"IF(Teacher4Pretest!C12=\"\",\"\",Teacher4Pretest!E12)","v":0.16666666666666666},4,6,0.66666666666666663,{"$f":"IF(D12>=P8,B12,\"\")","v":""},"Michael Jordan, Muhammad Ali",{"$f":"IF(D12>=P9,IF(D12<P8,B12,\"\"),\"\")","v":"Wayne Gretzky"},", Roger Federer, Wayne Gretzky",{"$f":"IF(D12>=P10,IF(D12<P9,B12,\"\"),\"\")","v":""},"",{"$f":"IF(D12<P10,IF(D12=\"\",\"\",B12),\"\")","v":""},", **Michael Phelps"]
[4,{"$f":"Data!D7","v":"**Jim Thorpe"},{"$f":"IF(Teacher4Pretest!C13=\"\",\"\",Teacher4Pretest!E13)","v":0.33333333333333331},4,6,0.66666666666666663,{"$f":"IF(D13>=P8,B13,\"\")","v":""},"Michael Jordan, Muhammad Ali",{"$f":"IF(D13>=P9,IF(D13<P8,B13,\"\"),\"\")","v":"**Jim Thorpe"},", Roger Federer, Wayne Gretzky, **Jim Thorpe",{"$f":"IF(D13>=P10,IF(D13<P9,B13,\"\"),\"\")","v":""},"",{"$f":"IF(D13<P10,IF(D13=\"\",\"\",B13),\"\")","v":""},", **Michael Phelps"]
[false,{"$f":"Data!D8","v":"Tiger Woods"},{"$f":"IF(Teacher4Pretest!C14=\"\",\"\",Teacher4Pretest!E14)","v":0.33333333333333331},2,6,0.33333333333333331,{"$f":"IF(D14>=P8,B14,\"\")","v":""},"Michael Jordan, Muhammad Ali",{"$f":"IF(D14>=P9,IF(D14<P8,B14,\"\"),\"\")","v":""},", Roger Federer, Wayne Gretzky, **Jim Thorpe",{"$f":"IF(D14>=P10,IF(D14<P9,B14,\"\"),\"\")","v":""},"",{"$f":"IF(D14<P10,IF(D14=\"\",\"\",B14),\"\")","v":"Tiger Woods"},", **Michael Phelps, Tiger Woods"]
[false,{"$f":"Data!D9","v":"Serena Williams"},{"$f":"IF(Teacher4Pretest!C15=\"\",\"\",Teacher4Pretest!E15)","v":0.33333333333333331},5,6,0.83333333333333337,{"$f":"IF(D15>=P8,B15,\"\")","v":"Serena Williams"},"Michael Jordan, Muhammad Ali, Serena Williams",{"$f":"IF(D15>=P9,IF(D15<P8,B15,\"\"),\"\")","v":""},", Roger Federer, Wayne Gretzky, **Jim Thorpe",{"$f":"IF(D15>=P10,IF(D15<P9,B15,\"\"),\"\")","v":""},"",{"$f":"IF(D15<P10,IF(D15=\"\",\"\",B15),\"\")","v":""},", **Michael Phelps, Tiger Woods"]
[5,{"$f":"Data!D10","v":"**Joe Montana"},{"$f":"IF(Teacher4Pretest!C16=\"\",\"\",Teacher4Pretest!E16)","v":0.16666666666666666},5,6,0.83333333333333337,{"$f":"IF(D16>=P8,B16,\"\")","v":"**Joe Montana"},"Michael Jordan, Muhammad Ali, Serena Williams, **Joe Montana",{"$f":"IF(D16>=P9,IF(D16<P8,B16,\"\"),\"\")","v":""},", Roger Federer, Wayne Gretzky, **Jim Thorpe",{"$f":"IF(D16>=P10,IF(D16<P9,B16,\"\"),\"\")","v":""},"",{"$f":"IF(D16<P10,IF(D16=\"\",\"\",B16),\"\")","v":""},", **Michael Phelps, Tiger Woods"]
[false,{"$f":"Data!D11","v":"Jeff Gordon"},{"$f":"IF(Teacher4Pretest!C17=\"\",\"\",Teacher4Pretest!E17)","v":0.66666666666666663},4,6,0.66666666666666663,{"$f":"IF(D17>=P8,B17,\"\")","v":""},"Michael Jordan, Muhammad Ali, Serena Williams, **Joe Montana",{"$f":"IF(D17>=P9,IF(D17<P8,B17,\"\"),\"\")","v":"Jeff Gordon"},", Roger Federer, Wayne Gretzky, **Jim Thorpe, Jeff Gordon",{"$f":"IF(D17>=P10,IF(D17<P9,B17,\"\"),\"\")","v":""},"",{"$f":"IF(D17<P10,IF(D17=\"\",\"\",B17),\"\")","v":""},", **Michael Phelps, Tiger Woods"]
[false,{"$f":"Data!D12","v":"Peyton Manning"},{"$f":"IF(Teacher4Pretest!C18=\"\",\"\",Teacher4Pretest!E18)","v":0.33333333333333331},4,6,0.66666666666666663,{"$f":"IF(D18>=P8,B18,\"\")","v":""},"Michael Jordan, Muhammad Ali, Serena Williams, **Joe Montana",{"$f":"IF(D18>=P9,IF(D18<P8,B18,\"\"),\"\")","v":"Peyton Manning"},", Roger Federer, Wayne Gretzky, **Jim Thorpe, Jeff Gordon, Peyton Manning",{"$f":"IF(D18>=P10,IF(D18<P9,B18,\"\"),\"\")","v":""},"",{"$f":"IF(D18<P10,IF(D18=\"\",\"\",B18),\"\")","v":""},", **Michael Phelps, Tiger Woods"]
[false,{"$f":"Data!D13","v":"Shaun White"},{"$f":"IF(Teacher4Pretest!C19=\"\",\"\",Teacher4Pretest!E19)","v":0.83333333333333337},5,6,0.83333333333333337,{"$f":"IF(D19>=P8,B19,\"\")","v":"Shaun White"},"Michael Jordan, Muhammad Ali, Serena Williams, **Joe Montana, Shaun White",{"$f":"IF(D19>=P9,IF(D19<P8,B19,\"\"),\"\")","v":""},", Roger Federer, Wayne Gretzky, **Jim Thorpe, Jeff Gordon, Peyton Manning",{"$f":"IF(D19>=P10,IF(D19<P9,B19,\"\"),\"\")","v":""},"",{"$f":"IF(D19<P10,IF(D19=\"\",\"\",B19),\"\")","v":""},", **Michael Phelps, Tiger Woods"]
[false,{"$f":"Data!D14","v":"Danica Patrick"},{"$f":"IF(Teacher4Pretest!C20=\"\",\"\",Teacher4Pretest!E20)","v":0.83333333333333337},6,6,1,{"$f":"IF(D20>=P8,B20,\"\")","v":"Danica Patrick"},"Michael Jordan, Muhammad Ali, Serena Williams, **Joe Montana, Shaun White, Danica Patrick",{"$f":"IF(D20>=P9,IF(D20<P8,B20,\"\"),\"\")","v":""},", Roger Federer, Wayne Gretzky, **Jim Thorpe, Jeff Gordon, Peyton Manning",{"$f":"IF(D20>=P10,IF(D20<P9,B20,\"\"),\"\")","v":""},"",{"$f":"IF(D20<P10,IF(D20=\"\",\"\",B20),\"\")","v":""},", **Michael Phelps, Tiger Woods"]
[5,{"$f":"Data!D15","v":"**Tony Hawk"},{"$f":"IF(Teacher4Pretest!C21=\"\",\"\",Teacher4Pretest!E21)","v":0.5},5,6,0.83333333333333337,{"$f":"IF(D21>=P8,B21,\"\")","v":"**Tony Hawk"},"Michael Jordan, Muhammad Ali, Serena Williams, **Joe Montana, Shaun White, Danica Patrick, **Tony Hawk",{"$f":"IF(D21>=P9,IF(D21<P8,B21,\"\"),\"\")","v":""},", Roger Federer, Wayne Gretzky, **Jim Thorpe, Jeff Gordon, Peyton Manning",{"$f":"IF(D21>=P10,IF(D21<P9,B21,\"\"),\"\")","v":""},"",{"$f":"IF(D21<P10,IF(D21=\"\",\"\",B21),\"\")","v":""},", **Michael Phelps, Tiger Woods"]
[false,{"$f":"Data!D16","v":"LeBron James"},{"$f":"IF(Teacher4Pretest!C22=\"\",\"\",Teacher4Pretest!E22)","v":0.83333333333333337},6,6,1,{"$f":"IF(D22>=P8,B22,\"\")","v":"LeBron James"},"Michael Jordan, Muhammad Ali, Serena Williams, **Joe Montana, Shaun White, Danica Patrick, **Tony Hawk, LeBron James",{"$f":"IF(D22>=P9,IF(D22<P8,B22,\"\"),\"\")","v":""},", Roger Federer, Wayne Gretzky, **Jim Thorpe, Jeff Gordon, Peyton Manning",{"$f":"IF(D22>=P10,IF(D22<P9,B22,\"\"),\"\")","v":""},"",{"$f":"IF(D22<P10,IF(D22=\"\",\"\",B22),\"\")","v":""},", **Michael Phelps, Tiger Woods"]
[false,{"$f":"Data!D17","v":"Gordie Howe"},{"$f":"IF(Teacher4Pretest!C23=\"\",\"\",Teacher4Pretest!E23)","v":0.83333333333333337},2,6,0.33333333333333331,{"$f":"IF(D23>=P8,B23,\"\")","v":""},"Michael Jordan, Muhammad Ali, Serena Williams, **Joe Montana, Shaun White, Danica Patrick, **Tony Hawk, LeBron James",{"$f":"IF(D23>=P9,IF(D23<P8,B23,\"\"),\"\")","v":""},", Roger Federer, Wayne Gretzky, **Jim Thorpe, Jeff Gordon, Peyton Manning",{"$f":"IF(D23>=P10,IF(D23<P9,B23,\"\"),\"\")","v":""},"",{"$f":"IF(D23<P10,IF(D23=\"\",\"\",B23),\"\")","v":"Gordie Howe"},", **Michael Phelps, Tiger Woods, Gordie Howe"]
[5,{"$f":"Data!D18","v":"**George Forman"},{"$f":"IF(Teacher4Pretest!C24=\"\",\"\",Teacher4Pretest!E24)","v":0.5},6,6,1,{"$f":"IF(D24>=P8,B24,\"\")","v":"**George Forman"},"Michael Jordan, Muhammad Ali, Serena Williams, **Joe Montana, Shaun White, Danica Patrick, **Tony Hawk, LeBron James, **George Forman",{"$f":"IF(D24>=P9,IF(D24<P8,B24,\"\"),\"\")","v":""},", Roger Federer, Wayne Gretzky, **Jim Thorpe, Jeff Gordon, Peyton Manning",{"$f":"IF(D24>=P10,IF(D24<P9,B24,\"\"),\"\")","v":""},"",{"$f":"IF(D24<P10,IF(D24=\"\",\"\",B24),\"\")","v":""},", **Michael Phelps, Tiger Woods, Gordie Howe"]
[false,{"$f":"Data!D19","v":"Martina Navratilova"},{"$f":"IF(Teacher4Pretest!C25=\"\",\"\",Teacher4Pretest!E25)","v":0.83333333333333337},5,6,0.83333333333333337,{"$f":"IF(D25>=P8,B25,\"\")","v":"Martina Navratilova"},"Michael Jordan, Muhammad Ali, Serena Williams, **Joe Montana, Shaun White, Danica Patrick, **Tony Hawk, LeBron James, **George Forman, Martina Navratilova",{"$f":"IF(D25>=P9,IF(D25<P8,B25,\"\"),\"\")","v":""},", Roger Federer, Wayne Gretzky, **Jim Thorpe, Jeff Gordon, Peyton Manning",{"$f":"IF(D25>=P10,IF(D25<P9,B25,\"\"),\"\")","v":""},"",{"$f":"IF(D25<P10,IF(D25=\"\",\"\",B25),\"\")","v":""},", **Michael Phelps, Tiger Woods, Gordie Howe"]
[false,{"$f":"Data!D20","v":"Yadier Molina"},{"$f":"IF(Teacher4Pretest!C26=\"\",\"\",Teacher4Pretest!E26)","v":1},4,6,0.66666666666666663,{"$f":"IF(D26>=P8,B26,\"\")","v":""},"Michael Jordan, Muhammad Ali, Serena Williams, **Joe Montana, Shaun White, Danica Patrick, **Tony Hawk, LeBron James, **George Forman, Martina Navratilova",{"$f":"IF(D26>=P9,IF(D26<P8,B26,\"\"),\"\")","v":"Yadier Molina"},", Roger Federer, Wayne Gretzky, **Jim Thorpe, Jeff Gordon, Peyton Manning, Yadier Molina",{"$f":"IF(D26>=P10,IF(D26<P9,B26,\"\"),\"\")","v":""},"",{"$f":"IF(D26<P10,IF(D26=\"\",\"\",B26),\"\")","v":""},", **Michael Phelps, Tiger Woods, Gordie Howe"]
["FALSE",{"$f":"Data!D21","v":"Student20"},{"$f":"IF(Teacher4Pretest!C27=\"\",\"\",Teacher4Pretest!E27)","v":""},null,"","",{"$f":"IF(D27>=P8,B27,\"\")","v":""},"Michael Jordan, Muhammad Ali, Serena Williams, **Joe Montana, Shaun White, Danica Patrick, **Tony Hawk, LeBron James, **George Forman, Martina Navratilova",{"$f":"IF(D27>=P9,IF(D27<P8,B27,\"\"),\"\")","v":""},", Roger Federer, Wayne Gretzky, **Jim Thorpe, Jeff Gordon, Peyton Manning, Yadier Molina",{"$f":"IF(D27>=P10,IF(D27<P9,B27,\"\"),\"\")","v":""},"",{"$f":"IF(D27<P10,IF(D27=\"\",\"\",B27),\"\")","v":""},", **Michael Phelps, Tiger Woods, Gordie Howe"]
["FALSE",{"$f":"Data!D22","v":"Student21"},{"$f":"IF(Teacher4Pretest!C28=\"\",\"\",Teacher4Pretest!E28)","v":""},null,"","",{"$f":"IF(D28>=P8,B28,\"\")","v":""},"Michael Jordan, Muhammad Ali, Serena Williams, **Joe Montana, Shaun White, Danica Patrick, **Tony Hawk, LeBron James, **George Forman, Martina Navratilova",{"$f":"IF(D28>=P9,IF(D28<P8,B28,\"\"),\"\")","v":""},", Roger Federer, Wayne Gretzky, **Jim Thorpe, Jeff Gordon, Peyton Manning, Yadier Molina",{"$f":"IF(D28>=P10,IF(D28<P9,B28,\"\"),\"\")","v":""},"",{"$f":"IF(D28<P10,IF(D28=\"\",\"\",B28),\"\")","v":""},", **Michael Phelps, Tiger Woods, Gordie Howe"]
["FALSE",{"$f":"Data!D23","v":"Student22"},{"$f":"IF(Teacher4Pretest!C29=\"\",\"\",Teacher4Pretest!E29)","v":""},null,"","",{"$f":"IF(D29>=P8,B29,\"\")","v":""},"Michael Jordan, Muhammad Ali, Serena Williams, **Joe Montana, Shaun White, Danica Patrick, **Tony Hawk, LeBron James, **George Forman, Martina Navratilova",{"$f":"IF(D29>=P9,IF(D29<P8,B29,\"\"),\"\")","v":""},", Roger Federer, Wayne Gretzky, **Jim Thorpe, Jeff Gordon, Peyton Manning, Yadier Molina",{"$f":"IF(D29>=P10,IF(D29<P9,B29,\"\"),\"\")","v":""},"",{"$f":"IF(D29<P10,IF(D29=\"\",\"\",B29),\"\")","v":""},", **Michael Phelps, Tiger Woods, Gordie Howe"]
["FALSE",{"$f":"Data!D24","v":"Student23"},{"$f":"IF(Teacher4Pretest!C30=\"\",\"\",Teacher4Pretest!E30)","v":""},null,"","",{"$f":"IF(D30>=P8,B30,\"\")","v":""},"Michael Jordan, Muhammad Ali, Serena Williams, **Joe Montana, Shaun White, Danica Patrick, **Tony Hawk, LeBron James, **George Forman, Martina Navratilova",{"$f":"IF(D30>=P9,IF(D30<P8,B30,\"\"),\"\")","v":""},", Roger Federer, Wayne Gretzky, **Jim Thorpe, Jeff Gordon, Peyton Manning, Yadier Molina",{"$f":"IF(D30>=P10,IF(D30<P9,B30,\"\"),\"\")","v":""},"",{"$f":"IF(D30<P10,IF(D30=\"\",\"\",B30),\"\")","v":""},", **Michael Phelps, Tiger Woods, Gordie Howe"]
["FALSE",{"$f":"Data!D25","v":"Student24"},{"$f":"IF(Teacher4Pretest!C31=\"\",\"\",Teacher4Pretest!E31)","v":""},null,"","",{"$f":"IF(D31>=P8,B31,\"\")","v":""},"Michael Jordan, Muhammad Ali, Serena Williams, **Joe Montana, Shaun White, Danica Patrick, **Tony Hawk, LeBron James, **George Forman, Martina Navratilova",{"$f":"IF(D31>=P9,IF(D31<P8,B31,\"\"),\"\")","v":""},", Roger Federer, Wayne Gretzky, **Jim Thorpe, Jeff Gordon, Peyton Manning, Yadier Molina",{"$f":"IF(D31>=P10,IF(D31<P9,B31,\"\"),\"\")","v":""},"",{"$f":"IF(D31<P10,IF(D31=\"\",\"\",B31),\"\")","v":""},", **Michael Phelps, Tiger Woods, Gordie Howe"]
["FALSE",{"$f":"Data!D26","v":"Student25"},{"$f":"IF(Teacher4Pretest!C32=\"\",\"\",Teacher4Pretest!E32)","v":""},null,"","",{"$f":"IF(D32>=P8,B32,\"\")","v":""},"Michael Jordan, Muhammad Ali, Serena Williams, **Joe Montana, Shaun White, Danica Patrick, **Tony Hawk, LeBron James, **George Forman, Martina Navratilova",{"$f":"IF(D32>=P9,IF(D32<P8,B32,\"\"),\"\")","v":""},", Roger Federer, Wayne Gretzky, **Jim Thorpe, Jeff Gordon, Peyton Manning, Yadier Molina",{"$f":"IF(D32>=P10,IF(D32<P9,B32,\"\"),\"\")","v":""},"",{"$f":"IF(D32<P10,IF(D32=\"\",\"\",B32),\"\")","v":""},", **Michael Phelps, Tiger Woods, Gordie Howe"]
["FALSE",{"$f":"Data!D27","v":"Student26"},{"$f":"IF(Teacher4Pretest!C33=\"\",\"\",Teacher4Pretest!E33)","v":""},null,"","",{"$f":"IF(D33>=P8,B33,\"\")","v":""},"Michael Jordan, Muhammad Ali, Serena Williams, **Joe Montana, Shaun White, Danica Patrick, **Tony Hawk, LeBron James, **George Forman, Martina Navratilova",{"$f":"IF(D33>=P9,IF(D33<P8,B33,\"\"),\"\")","v":""},", Roger Federer, Wayne Gretzky, **Jim Thorpe, Jeff Gordon, Peyton Manning, Yadier Molina",{"$f":"IF(D33>=P10,IF(D33<P9,B33,\"\"),\"\")","v":""},"",{"$f":"IF(D33<P10,IF(D33=\"\",\"\",B33),\"\")","v":""},", **Michael Phelps, Tiger Woods, Gordie Howe"]
["FALSE",{"$f":"Data!D28","v":"Student27"},{"$f":"IF(Teacher4Pretest!C34=\"\",\"\",Teacher4Pretest!E34)","v":""},null,"","",{"$f":"IF(D34>=P8,B34,\"\")","v":""},"Michael Jordan, Muhammad Ali, Serena Williams, **Joe Montana, Shaun White, Danica Patrick, **Tony Hawk, LeBron James, **George Forman, Martina Navratilova",{"$f":"IF(D34>=P9,IF(D34<P8,B34,\"\"),\"\")","v":""},", Roger Federer, Wayne Gretzky, **Jim Thorpe, Jeff Gordon, Peyton Manning, Yadier Molina",{"$f":"IF(D34>=P10,IF(D34<P9,B34,\"\"),\"\")","v":""},"",{"$f":"IF(D34<P10,IF(D34=\"\",\"\",B34),\"\")","v":""},", **Michael Phelps, Tiger Woods, Gordie Howe"]
["FALSE",{"$f":"Data!D29","v":"Student28"},{"$f":"IF(Teacher4Pretest!C35=\"\",\"\",Teacher4Pretest!E35)","v":""},null,"","",{"$f":"IF(D35>=P8,B35,\"\")","v":""},"Michael Jordan, Muhammad Ali, Serena Williams, **Joe Montana, Shaun White, Danica Patrick, **Tony Hawk, LeBron James, **George Forman, Martina Navratilova",{"$f":"IF(D35>=P9,IF(D35<P8,B35,\"\"),\"\")","v":""},", Roger Federer, Wayne Gretzky, **Jim Thorpe, Jeff Gordon, Peyton Manning, Yadier Molina",{"$f":"IF(D35>=P10,IF(D35<P9,B35,\"\"),\"\")","v":""},"",{"$f":"IF(D35<P10,IF(D35=\"\",\"\",B35),\"\")","v":""},", **Michael Phelps, Tiger Woods, Gordie Howe"]
["FALSE",{"$f":"Data!D30","v":"Student29"},{"$f":"IF(Teacher4Pretest!C36=\"\",\"\",Teacher4Pretest!E36)","v":""},null,"","",{"$f":"IF(D36>=P8,B36,\"\")","v":""},"Michael Jordan, Muhammad Ali, Serena Williams, **Joe Montana, Shaun White, Danica Patrick, **Tony Hawk, LeBron James, **George Forman, Martina Navratilova",{"$f":"IF(D36>=P9,IF(D36<P8,B36,\"\"),\"\")","v":""},", Roger Federer, Wayne Gretzky, **Jim Thorpe, Jeff Gordon, Peyton Manning, Yadier Molina",{"$f":"IF(D36>=P10,IF(D36<P9,B36,\"\"),\"\")","v":""},"",{"$f":"IF(D36<P10,IF(D36=\"\",\"\",B36),\"\")","v":""},", **Michael Phelps, Tiger Woods, Gordie Howe"]
["FALSE",{"$f":"Data!D31","v":"Student30"},{"$f":"IF(Teacher4Pretest!C37=\"\",\"\",Teacher4Pretest!E37)","v":""},null,"","",{"$f":"IF(D37>=P8,B37,\"\")","v":""},"Michael Jordan, Muhammad Ali, Serena Williams, **Joe Montana, Shaun White, Danica Patrick, **Tony Hawk, LeBron James, **George Forman, Martina Navratilova",{"$f":"IF(D37>=P9,IF(D37<P8,B37,\"\"),\"\")","v":""},", Roger Federer, Wayne Gretzky, **Jim Thorpe, Jeff Gordon, Peyton Manning, Yadier Molina",{"$f":"IF(D37>=P10,IF(D37<P9,B37,\"\"),\"\")","v":""},"",{"$f":"IF(D37<P10,IF(D37=\"\",\"\",B37),\"\")","v":""},", **Michael Phelps, Tiger Woods, Gordie Howe"]
["FALSE"]
[null,"TOTAL",null,{"$f":"SUM(D8:D37)","v":83},{"$f":"SUM(E8:E37)","v":114},{"$f":"D39/E39","v":0.72807017543859653}]

{"sheet":"Teacher5Post","index":19,"n_rows":39,"n_cols":17,"rows_kept":39,"cut":false,"hidden":false,"merged":[[4,1,6,1],[4,3,6,3],[4,4,5,4],[4,5,6,5],[0,1,0,3],[0,4,0,5],[1,1,1,3],[1,4,1,5],[2,1,3,3],[2,4,3,5],[4,2,6,2]]}
[null,{"$f":"IF(Data!N6=\"Other\",Data!N7,Data!N6)","v":"Grade 4"},null,null,{"$f":"Data!F1","v":"Milburn"}]
[null,"Meeting Date:",null,null,{"$f":"Data!O8","v":"3/20/14"}]
[null,"Assessment:",null,null,{"$f":"Teacher1Pretest!D3","v":"Main Idea- R.I.4.2"}]
[]
[null,"Student Name","Pretest %","Post-test Points","Possible","Score - %"]
[]
[null,null,null,null,{"$f":"Teacher1Post!P7","v":6},null,"Proficient",null,"Close",null,"Far",null,"Intervention",null,null,{"$f":"Data!O10","v":6},"Points Possible on Post-Test"]
[{"$f":"IF(ISBLANK(D8),\"FALSE\",IF(LEFT(B8,2)=\"**\",IF(D8>=$P$8,$P$8,IF(D8>=$P$9,$P$9,IF(D8>=$P$10,$P$10,$P$11)))))","v":false},{"$f":"Data!F2","v":"Dave Sanders"},{"$f":"IF(Teacher5Pretest!C8=\"\",\"\",Teacher5Pretest!E8)","v":0.5},5,{"$f":"IF(D8=\"\",\"\",$E$7)","v":6},{"$f":"IF(E8=\"\",\"\",D8/$E$7)","v":0.83333333333333337},{"$f":"IF(D8>=P8,B8,\"\")","v":"Dave Sanders"},{"$f":"G8","v":"Dave Sanders"},{"$f":"IF(D8>=P9,IF(D8<P8,B8,\"\"),\"\")","v":""},{"$f":"I8","v":""},{"$f":"IF(D8>=P10,IF(D8<P9,B8,\"\"),\"\")","v":""},{"$f":"K8","v":""},{"$f":"IF(D8<P10,IF(D8=\"\",\"\",B8),\"\")","v":""},{"$f":"M8","v":""},null,{"$f":"Data!O11","v":5},"Proficient"]
[{"$f":"IF(ISBLANK(D9),\"FALSE\",IF(LEFT(B9,2)=\"**\",IF(D9>=$P$8,$P$8,IF(D9>=$P$9,$P$9,IF(D9>=$P$10,$P$10,$P$11)))))","v":false},{"$f":"Data!F3","v":"Carolyn Neal"},{"$f":"IF(Teacher5Pretest!C9=\"\",\"\",Teacher5Pretest!E9)","v":0.5},5,{"$f":"IF(D9=\"\",\"\",$E$7)","v":6},{"$f":"IF(E9=\"\",\"\",D9/$E$7)","v":0.83333333333333337},{"$f":"IF(D9>=P8,B9,\"\")","v":"Carolyn Neal"},{"$f":"H8&IF(G9=\"\",\"\",\", \")&G9","v":"Dave Sanders, Carolyn Neal"},{"$f":"IF(D9>=P9,IF(D9<P8,B9,\"\"),\"\")","v":""},{"$f":"J8&IF(I9=\"\",\"\",\", \")&I9","v":""},{"$f":"IF(D9>=P10,IF(D9<P9,B9,\"\"),\"\")","v":""},{"$f":"L8&IF(K9=\"\",\"\",\", \")&K9","v":""},{"$f":"IF(D9<P10,IF(D9=\"\",\"\",B9),\"\")","v":""},{"$f":"N8&IF(M9=\"\",\"\",\", \")&M9","v":""},null,{"$f":"Data!O12","v":4},"Close to Proficient"]
[false,{"$f":"Data!F4","v":"Bertha Richardson"},{"$f":"IF(Teacher5Pretest!C10=\"\",\"\",Teacher5Pretest!E10)","v":0.66666666666666663},6,6,1,{"$f":"IF(D10>=P8,B10,\"\")","v":"Bertha Richardson"},{"$f":"H9&IF(G10=\"\",\"\",\", \")&G10","v":"Dave Sanders, Carolyn Neal, Bertha Richardson"},{"$f":"IF(D10>=P9,IF(D10<P8,B10,\"\"),\"\")","v":""},{"$f":"J9&IF(I10=\"\",\"\",\", \")&I10","v":""},{"$f":"IF(D10>=P10,IF(D10<P9,B10,\"\"),\"\")","v":""},{"$f":"L9&IF(K10=\"\",\"\",\", \")&K10","v":""},{"$f":"IF(D10<P10,IF(D10=\"\",\"\",B10),\"\")","v":""},{"$f":"N9&IF(M10=\"\",\"\",\", \")&M10","v":""},null,{"$f":"Data!O13","v":3},"Far to Go But Likely to Become Proficient"]
[false,{"$f":"Data!F5","v":"Bill Scheffler"},{"$f":"IF(Teacher5Pretest!C11=\"\",\"\",Teacher5Pretest!E11)","v":0.66666666666666663},2,6,0.33333333333333331,{"$f":"IF(D11>=P8,B11,\"\")","v":""},"Dave Sanders, Carolyn Neal, Bertha Richardson",{"$f":"IF(D11>=P9,IF(D11<P8,B11,\"\"),\"\")","v":""},"",{"$f":"IF(D11>=P10,IF(D11<P9,B11,\"\"),\"\")","v":""},"",{"$f":"IF(D11<P10,IF(D11=\"\",\"\",B11),\"\")","v":"Bill Scheffler"},", Bill Scheffler",null,{"$f":"Data!O14","v":1},"Intervention (Far to Go But Not Likely to Become Proficient)"]
[false,{"$f":"Data!F6","v":"Chris Montgomery"},{"$f":"IF(Teacher5Pretest!C12=\"\",\"\",Teacher5Pretest!E12)","v":0.83333333333333337},6,6,1,{"$f":"IF(D12>=P8,B12,\"\")","v":"Chris Montgomery"},"Dave Sanders, Carolyn Neal, Bertha Richardson, Chris Montgomery",{"$f":"IF(D12>=P9,IF(D12<P8,B12,\"\"),\"\")","v":""},"",{"$f":"IF(D12>=P10,IF(D12<P9,B12,\"\"),\"\")","v":""},"",{"$f":"IF(D12<P10,IF(D12=\"\",\"\",B12),\"\")","v":""},", Bill Scheffler"]
[false,{"$f":"Data!F7","v":"Darlene Jones"},{"$f":"IF(Teacher5Pretest!C13=\"\",\"\",Teacher5Pretest!E13)","v":0.33333333333333331},5,6,0.83333333333333337,{"$f":"IF(D13>=P8,B13,\"\")","v":"Darlene Jones"},"Dave Sanders, Carolyn Neal, Bertha Richardson, Chris Montgomery, Darlene Jones",{"$f":"IF(D13>=P9,IF(D13<P8,B13,\"\"),\"\")","v":""},"",{"$f":"IF(D13>=P10,IF(D13<P9,B13,\"\"),\"\")","v":""},"",{"$f":"IF(D13<P10,IF(D13=\"\",\"\",B13),\"\")","v":""},", Bill Scheffler"]
[false,{"$f":"Data!F8","v":"Don Rugraff"},{"$f":"IF(Teacher5Pretest!C14=\"\",\"\",Teacher5Pretest!E14)","v":0.83333333333333337},4,6,0.66666666666666663,{"$f":"IF(D14>=P8,B14,\"\")","v":""},"Dave Sanders, Carolyn Neal, Bertha Richardson, Chris Montgomery, Darlene Jones",{"$f":"IF(D14>=P9,IF(D14<P8,B14,\"\"),\"\")","v":"Don Rugraff"},", Don Rugraff",{"$f":"IF(D14>=P10,IF(D14<P9,B14,\"\"),\"\")","v":""},"",{"$f":"IF(D14<P10,IF(D14=\"\",\"\",B14),\"\")","v":""},", Bill Scheffler"]
[false,{"$f":"Data!F9","v":"Dexter Schraer"},{"$f":"IF(Teacher5Pretest!C15=\"\",\"\",Teacher5Pretest!E15)","v":0.5},5,6,0.83333333333333337,{"$f":"IF(D15>=P8,B15,\"\")","v":"Dexter Schraer"},"Dave Sanders, Carolyn Neal, Bertha Richardson, Chris Montgomery, Darlene Jones, Dexter Schraer",{"$f":"IF(D15>=P9,IF(D15<P8,B15,\"\"),\"\")","v":""},", Don Rugraff",{"$f":"IF(D15>=P10,IF(D15<P9,B15,\"\"),\"\")","v":""},"",{"$f":"IF(D15<P10,IF(D15=\"\",\"\",B15),\"\")","v":""},", Bill Scheffler"]
[false,{"$f":"Data!F10","v":"Janice Putman"},{"$f":"IF(Teacher5Pretest!C16=\"\",\"\",Teacher5Pretest!E16)","v":0.16666666666666666},5,6,0.83333333333333337,{"$f":"IF(D16>=P8,B16,\"\")","v":"Janice Putman"},"Dave Sanders, Carolyn Neal, Bertha Richardson, Chris Montgomery, Darlene Jones, Dexter Schraer, Janice Putman",{"$f":"IF(D16>=P9,IF(D16<P8,B16,\"\"),\"\")","v":""},", Don Rugraff",{"$f":"IF(D16>=P10,IF(D16<P9,B16,\"\"),\"\")","v":""},"",{"$f":"IF(D16<P10,IF(D16=\"\",\"\",B16),\"\")","v":""},", Bill Scheffler"]
[false,{"$f":"Data!F11","v":"Julie Sperry"},{"$f":"IF(Teacher5Pretest!C17=\"\",\"\",Teacher5Pretest!E17)","v":0.5},6,6,1,{"$f":"IF(D17>=P8,B17,\"\")","v":"Julie Sperry"},"Dave Sanders, Carolyn Neal, Bertha Richardson, Chris Montgomery, Darlene Jones, Dexter Schraer, Janice Putman, Julie Sperry",{"$f":"IF(D17>=P9,IF(D17<P8,B17,\"\"),\"\")","v":""},", Don Rugraff",{"$f":"IF(D17>=P10,IF(D17<P9,B17,\"\"),\"\")","v":""},"",{"$f":"IF(D17<P10,IF(D17=\"\",\"\",B17),\"\")","v":""},", Bill Scheffler"]
[false,{"$f":"Data!F12","v":"Jeanne Rothermel"},{"$f":"IF(Teacher5Pretest!C18=\"\",\"\",Teacher5Pretest!E18)","v":0.16666666666666666},4,6,0.66666666666666663,{"$f":"IF(D18>=P8,B18,\"\")","v":""},"Dave Sanders, Carolyn Neal, Bertha Richardson, Chris Montgomery, Darlene Jones, Dexter Schraer, Janice Putman, Julie Sperry",{"$f":"IF(D18>=P9,IF(D18<P8,B18,\"\"),\"\")","v":"Jeanne Rothermel"},", Don Rugraff, Jeanne Rothermel",{"$f":"IF(D18>=P10,IF(D18<P9,B18,\"\"),\"\")","v":""},"",{"$f":"IF(D18<P10,IF(D18=\"\",\"\",B18),\"\")","v":""},", Bill Scheffler"]
[false,{"$f":"Data!F13","v":"Rose Coleman"},{"$f":"IF(Teacher5Pretest!C19=\"\",\"\",Teacher5Pretest!E19)","v":0.66666666666666663},5,6,0.83333333333333337,{"$f":"IF(D19>=P8,B19,\"\")","v":"Rose Coleman"},"Dave Sanders, Carolyn Neal, Bertha Richardson, Chris Montgomery, Darlene Jones, Dexter Schraer, Janice Putman, Julie Sperry, Rose Coleman",{"$f":"IF(D19>=P9,IF(D19<P8,B19,\"\"),\"\")","v":""},", Don Rugraff, Jeanne Rothermel",{"$f":"IF(D19>=P10,IF(D19<P9,B19,\"\"),\"\")","v":""},"",{"$f":"IF(D19<P10,IF(D19=\"\",\"\",B19),\"\")","v":""},", Bill Scheffler"]
[false,{"$f":"Data!F14","v":"Randy Speer"},{"$f":"IF(Teacher5Pretest!C20=\"\",\"\",Teacher5Pretest!E20)","v":0.33333333333333331},3,6,0.5,{"$f":"IF(D20>=P8,B20,\"\")","v":""},"Dave Sanders, Carolyn Neal, Bertha Richardson, Chris Montgomery, Darlene Jones, Dexter Schraer, Janice Putman, Julie Sperry, Rose Coleman",{"$f":"IF(D20>=P9,IF(D20<P8,B20,\"\"),\"\")","v":""},", Don Rugraff, Jeanne Rothermel",{"$f":"IF(D20>=P10,IF(D20<P9,B20,\"\"),\"\")","v":"Randy Speer"},", Randy Speer",{"$f":"IF(D20<P10,IF(D20=\"\",\"\",B20),\"\")","v":""},", Bill Scheffler"]
[5,{"$f":"Data!F15","v":"**Sam McCauley"},{"$f":"IF(Teacher5Pretest!C21=\"\",\"\",Teacher5Pretest!E21)","v":0.5},5,6,0.83333333333333337,{"$f":"IF(D21>=P8,B21,\"\")","v":"**Sam McCauley"},"Dave Sanders, Carolyn Neal, Bertha Richardson, Chris Montgomery, Darlene Jones, Dexter Schraer, Janice Putman, Julie Sperry, Rose Coleman, **Sam McCauley",{"$f":"IF(D21>=P9,IF(D21<P8,B21,\"\"),\"\")","v":""},", Don Rugraff, Jeanne Rothermel",{"$f":"IF(D21>=P10,IF(D21<P9,B21,\"\"),\"\")","v":""},", Randy Speer",{"$f":"IF(D21<P10,IF(D21=\"\",\"\",B21),\"\")","v":""},", Bill Scheffler"]
[false,{"$f":"Data!F16","v":"Tricia Buchanan"},{"$f":"IF(Teacher5Pretest!C22=\"\",\"\",Teacher5Pretest!E22)","v":0.66666666666666663},6,6,1,{"$f":"IF(D22>=P8,B22,\"\")","v":"Tricia Buchanan"},"Dave Sanders, Carolyn Neal, Bertha Richardson, Chris Montgomery, Darlene Jones, Dexter Schraer, Janice Putman, Julie Sperry, Rose Coleman, **Sam McCauley, Tricia Buchanan",{"$f":"IF(D22>=P9,IF(D22<P8,B22,\"\"),\"\")","v":""},", Don Rugraff, Jeanne Rothermel",{"$f":"IF(D22>=P10,IF(D22<P9,B22,\"\"),\"\")","v":""},", Randy Speer",{"$f":"IF(D22<P10,IF(D22=\"\",\"\",B22),\"\")","v":""},", Bill Scheffler"]
[4,{"$f":"Data!F17","v":"**Beth Tobin"},{"$f":"IF(Teacher5Pretest!C23=\"\",\"\",Teacher5Pretest!E23)","v":0.33333333333333331},4,6,0.66666666666666663,{"$f":"IF(D23>=P8,B23,\"\")","v":""},"Dave Sanders, Carolyn Neal, Bertha Richardson, Chris Montgomery, Darlene Jones, Dexter Schraer, Janice Putman, Julie Sperry, Rose Coleman, **Sam McCauley, Tricia Buchanan",{"$f":"IF(D23>=P9,IF(D23<P8,B23,\"\"),\"\")","v":"**Beth Tobin"},", Don Rugraff, Jeanne Rothermel, **Beth Tobin",{"$f":"IF(D23>=P10,IF(D23<P9,B23,\"\"),\"\")","v":""},", Randy Speer",{"$f":"IF(D23<P10,IF(D23=\"\",\"\",B23),\"\")","v":""},", Bill Scheffler"]
["FALSE",{"$f":"Data!F18","v":"Student17"},{"$f":"IF(Teacher5Pretest!C24=\"\",\"\",Teacher5Pretest!E24)","v":""},null,"","",{"$f":"IF(D24>=P8,B24,\"\")","v":""},"Dave Sanders, Carolyn Neal, Bertha Richardson, Chris Montgomery, Darlene Jones, Dexter Schraer, Janice Putman, Julie Sperry, Rose Coleman, **Sam McCauley, Tricia Buchanan",{"$f":"IF(D24>=P9,IF(D24<P8,B24,\"\"),\"\")","v":""},", Don Rugraff, Jeanne Rothermel, **Beth Tobin",{"$f":"IF(D24>=P10,IF(D24<P9,B24,\"\"),\"\")","v":""},", Randy Speer",{"$f":"IF(D24<P10,IF(D24=\"\",\"\",B24),\"\")","v":""},", Bill Scheffler"]
["FALSE",{"$f":"Data!F19","v":"Student18"},{"$f":"IF(Teacher5Pretest!C25=\"\",\"\",Teacher5Pretest!E25)","v":""},null,"","",{"$f":"IF(D25>=P8,B25,\"\")","v":""},"Dave Sanders, Carolyn Neal, Bertha Richardson, Chris Montgomery, Darlene Jones, Dexter Schraer, Janice Putman, Julie Sperry, Rose Coleman, **Sam McCauley, Tricia Buchanan",{"$f":"IF(D25>=P9,IF(D25<P8,B25,\"\"),\"\")","v":""},", Don Rugraff, Jeanne Rothermel, **Beth Tobin",{"$f":"IF(D25>=P10,IF(D25<P9,B25,\"\"),\"\")","v":""},", Randy Speer",{"$f":"IF(D25<P10,IF(D25=\"\",\"\",B25),\"\")","v":""},", Bill Scheffler"]
["FALSE",{"$f":"Data!F20","v":"Student19"},{"$f":"IF(Teacher5Pretest!C26=\"\",\"\",Teacher5Pretest!E26)","v":""},null,"","",{"$f":"IF(D26>=P8,B26,\"\")","v":""},"Dave Sanders, Carolyn Neal, Bertha Richardson, Chris Montgomery, Darlene Jones, Dexter Schraer, Janice Putman, Julie Sperry, Rose Coleman, **Sam McCauley, Tricia Buchanan",{"$f":"IF(D26>=P9,IF(D26<P8,B26,\"\"),\"\")","v":""},", Don Rugraff, Jeanne Rothermel, **Beth Tobin",{"$f":"IF(D26>=P10,IF(D26<P9,B26,\"\"),\"\")","v":""},", Randy Speer",{"$f":"IF(D26<P10,IF(D26=\"\",\"\",B26),\"\")","v":""},", Bill Scheffler"]
["FALSE",{"$f":"Data!F21","v":"Student20"},{"$f":"IF(Teacher5Pretest!C27=\"\",\"\",Teacher5Pretest!E27)","v":""},null,"","",{"$f":"IF(D27>=P8,B27,\"\")","v":""},"Dave Sanders, Carolyn Neal, Bertha Richardson, Chris Montgomery, Darlene Jones, Dexter Schraer, Janice Putman, Julie Sperry, Rose Coleman, **Sam McCauley, Tricia Buchanan",{"$f":"IF(D27>=P9,IF(D27<P8,B27,\"\"),\"\")","v":""},", Don Rugraff, Jeanne Rothermel, **Beth Tobin",{"$f":"IF(D27>=P10,IF(D27<P9,B27,\"\"),\"\")","v":""},", Randy Speer",{"$f":"IF(D27<P10,IF(D27=\"\",\"\",B27),\"\")","v":""},", Bill Scheffler"]
["FALSE",{"$f":"Data!F22","v":"Student21"},{"$f":"IF(Teacher5Pretest!C28=\"\",\"\",Teacher5Pretest!E28)","v":""},null,"","",{"$f":"IF(D28>=P8,B28,\"\")","v":""},"Dave Sanders, Carolyn Neal, Bertha Richardson, Chris Montgomery, Darlene Jones, Dexter Schraer, Janice Putman, Julie Sperry, Rose Coleman, **Sam McCauley, Tricia Buchanan",{"$f":"IF(D28>=P9,IF(D28<P8,B28,\"\"),\"\")","v":""},", Don Rugraff, Jeanne Rothermel, **Beth Tobin",{"$f":"IF(D28>=P10,IF(D28<P9,B28,\"\"),\"\")","v":""},", Randy Speer",{"$f":"IF(D28<P10,IF(D28=\"\",\"\",B28),\"\")","v":""},", Bill Scheffler"]
["FALSE",{"$f":"Data!F23","v":"Student22"},{"$f":"IF(Teacher5Pretest!C29=\"\",\"\",Teacher5Pretest!E29)","v":""},null,"","",{"$f":"IF(D29>=P8,B29,\"\")","v":""},"Dave Sanders, Carolyn Neal, Bertha Richardson, Chris Montgomery, Darlene Jones, Dexter Schraer, Janice Putman, Julie Sperry, Rose Coleman, **Sam McCauley, Tricia Buchanan",{"$f":"IF(D29>=P9,IF(D29<P8,B29,\"\"),\"\")","v":""},", Don Rugraff, Jeanne Rothermel, **Beth Tobin",{"$f":"IF(D29>=P10,IF(D29<P9,B29,\"\"),\"\")","v":""},", Randy Speer",{"$f":"IF(D29<P10,IF(D29=\"\",\"\",B29),\"\")","v":""},", Bill Scheffler"]
["FALSE",{"$f":"Data!F24","v":"Student23"},{"$f":"IF(Teacher5Pretest!C30=\"\",\"\",Teacher5Pretest!E30)","v":""},null,"","",{"$f":"IF(D30>=P8,B30,\"\")","v":""},"Dave Sanders, Carolyn Neal, Bertha Richardson, Chris Montgomery, Darlene Jones, Dexter Schraer, Janice Putman, Julie Sperry, Rose Coleman, **Sam McCauley, Tricia Buchanan",{"$f":"IF(D30>=P9,IF(D30<P8,B30,\"\"),\"\")","v":""},", Don Rugraff, Jeanne Rothermel, **Beth Tobin",{"$f":"IF(D30>=P10,IF(D30<P9,B30,\"\"),\"\")","v":""},", Randy Speer",{"$f":"IF(D30<P10,IF(D30=\"\",\"\",B30),\"\")","v":""},", Bill Scheffler"]
["FALSE",{"$f":"Data!F25","v":"Student24"},{"$f":"IF(Teacher5Pretest!C31=\"\",\"\",Teacher5Pretest!E31)","v":""},null,"","",{"$f":"IF(D31>=P8,B31,\"\")","v":""},"Dave Sanders, Carolyn Neal, Bertha Richardson, Chris Montgomery, Darlene Jones, Dexter Schraer, Janice Putman, Julie Sperry, Rose Coleman, **Sam McCauley, Tricia Buchanan",{"$f":"IF(D31>=P9,IF(D31<P8,B31,\"\"),\"\")","v":""},", Don Rugraff, Jeanne Rothermel, **Beth Tobin",{"$f":"IF(D31>=P10,IF(D31<P9,B31,\"\"),\"\")","v":""},", Randy Speer",{"$f":"IF(D31<P10,IF(D31=\"\",\"\",B31),\"\")","v":""},", Bill Scheffler"]
["FALSE",{"$f":"Data!F26","v":"Student25"},{"$f":"IF(Teacher5Pretest!C32=\"\",\"\",Teacher5Pretest!E32)","v":""},null,"","",{"$f":"IF(D32>=P8,B32,\"\")","v":""},"Dave Sanders, Carolyn Neal, Bertha Richardson, Chris Montgomery, Darlene Jones, Dexter Schraer, Janice Putman, Julie Sperry, Rose Coleman, **Sam McCauley, Tricia Buchanan",{"$f":"IF(D32>=P9,IF(D32<P8,B32,\"\"),\"\")","v":""},", Don Rugraff, Jeanne Rothermel, **Beth Tobin",{"$f":"IF(D32>=P10,IF(D32<P9,B32,\"\"),\"\")","v":""},", Randy Speer",{"$f":"IF(D32<P10,IF(D32=\"\",\"\",B32),\"\")","v":""},", Bill Scheffler"]
["FALSE",{"$f":"Data!F27","v":"Student26"},{"$f":"IF(Teacher5Pretest!C33=\"\",\"\",Teacher5Pretest!E33)","v":""},null,"","",{"$f":"IF(D33>=P8,B33,\"\")","v":""},"Dave Sanders, Carolyn Neal, Bertha Richardson, Chris Montgomery, Darlene Jones, Dexter Schraer, Janice Putman, Julie Sperry, Rose Coleman, **Sam McCauley, Tricia Buchanan",{"$f":"IF(D33>=P9,IF(D33<P8,B33,\"\"),\"\")","v":""},", Don Rugraff, Jeanne Rothermel, **Beth Tobin",{"$f":"IF(D33>=P10,IF(D33<P9,B33,\"\"),\"\")","v":""},", Randy Speer",{"$f":"IF(D33<P10,IF(D33=\"\",\"\",B33),\"\")","v":""},", Bill Scheffler"]
["FALSE",{"$f":"Data!F28","v":"Student27"},{"$f":"IF(Teacher5Pretest!C34=\"\",\"\",Teacher5Pretest!E34)","v":""},null,"","",{"$f":"IF(D34>=P8,B34,\"\")","v":""},"Dave Sanders, Carolyn Neal, Bertha Richardson, Chris Montgomery, Darlene Jones, Dexter Schraer, Janice Putman, Julie Sperry, Rose Coleman, **Sam McCauley, Tricia Buchanan",{"$f":"IF(D34>=P9,IF(D34<P8,B34,\"\"),\"\")","v":""},", Don Rugraff, Jeanne Rothermel, **Beth Tobin",{"$f":"IF(D34>=P10,IF(D34<P9,B34,\"\"),\"\")","v":""},", Randy Speer",{"$f":"IF(D34<P10,IF(D34=\"\",\"\",B34),\"\")","v":""},", Bill Scheffler"]
["FALSE",{"$f":"Data!F29","v":"Student28"},{"$f":"IF(Teacher5Pretest!C35=\"\",\"\",Teacher5Pretest!E35)","v":""},null,"","",{"$f":"IF(D35>=P8,B35,\"\")","v":""},"Dave Sanders, Carolyn Neal, Bertha Richardson, Chris Montgomery, Darlene Jones, Dexter Schraer, Janice Putman, Julie Sperry, Rose Coleman, **Sam McCauley, Tricia Buchanan",{"$f":"IF(D35>=P9,IF(D35<P8,B35,\"\"),\"\")","v":""},", Don Rugraff, Jeanne Rothermel, **Beth Tobin",{"$f":"IF(D35>=P10,IF(D35<P9,B35,\"\"),\"\")","v":""},", Randy Speer",{"$f":"IF(D35<P10,IF(D35=\"\",\"\",B35),\"\")","v":""},", Bill Scheffler"]
["FALSE",{"$f":"Data!F30","v":"Student29"},{"$f":"IF(Teacher5Pretest!C36=\"\",\"\",Teacher5Pretest!E36)","v":""},null,"","",{"$f":"IF(D36>=P8,B36,\"\")","v":""},"Dave Sanders, Carolyn Neal, Bertha Richardson, Chris Montgomery, Darlene Jones, Dexter Schraer, Janice Putman, Julie Sperry, Rose Coleman, **Sam McCauley, Tricia Buchanan",{"$f":"IF(D36>=P9,IF(D36<P8,B36,\"\"),\"\")","v":""},", Don Rugraff, Jeanne Rothermel, **Beth Tobin",{"$f":"IF(D36>=P10,IF(D36<P9,B36,\"\"),\"\")","v":""},", Randy Speer",{"$f":"IF(D36<P10,IF(D36=\"\",\"\",B36),\"\")","v":""},", Bill Scheffler"]
["FALSE",{"$f":"Data!F31","v":"Student30"},{"$f":"IF(Teacher5Pretest!C37=\"\",\"\",Teacher5Pretest!E37)","v":""},null,"","",{"$f":"IF(D37>=P8,B37,\"\")","v":""},"Dave Sanders, Carolyn Neal, Bertha Richardson, Chris Montgomery, Darlene Jones, Dexter Schraer, Janice Putman, Julie Sperry, Rose Coleman, **Sam McCauley, Tricia Buchanan",{"$f":"IF(D37>=P9,IF(D37<P8,B37,\"\"),\"\")","v":""},", Don Rugraff, Jeanne Rothermel, **Beth Tobin",{"$f":"IF(D37>=P10,IF(D37<P9,B37,\"\"),\"\")","v":""},", Randy Speer",{"$f":"IF(D37<P10,IF(D37=\"\",\"\",B37),\"\")","v":""},", Bill Scheffler"]
["FALSE"]
[null,"TOTAL",null,{"$f":"SUM(D8:D37)","v":76},{"$f":"SUM(E8:E37)","v":96},{"$f":"D39/E39","v":0.79166666666666663}]

{"sheet":"Teacher6Post","index":20,"n_rows":39,"n_cols":17,"rows_kept":39,"cut":false,"hidden":false,"merged":[[4,1,6,1],[4,3,6,3],[4,4,5,4],[4,5,6,5],[0,1,0,3],[0,4,0,5],[1,1,1,3],[1,4,1,5],[2,1,3,3],[2,4,3,5],[4,2,6,2]]}
[null,{"$f":"IF(Data!N6=\"Other\",Data!N7,Data!N6)","v":"Grade 4"},null,null,{"$f":"Data!G1","v":"Teacher6"}]
[null,"Meeting Date:",null,null,{"$f":"Data!O8","v":"3/20/14"}]
[null,"Assessment:",null,null,{"$f":"Teacher1Pretest!D3","v":"Main Idea- R.I.4.2"}]
[]
[null,"Student Name","Pretest %","Post-test Points","Possible","Score - %"]
[]
[null,null,null,null,{"$f":"Teacher1Post!P7","v":6},null,"Proficient",null,"Close",null,"Far",null,"Intervention",null,null,{"$f":"Data!O10","v":6},"Points Possible on Post-Test"]
[{"$f":"IF(ISBLANK(D8),\"FALSE\",IF(LEFT(B8,2)=\"**\",IF(D8>=$P$8,$P$8,IF(D8>=$P$9,$P$9,IF(D8>=$P$10,$P$10,$P$11)))))","v":"FALSE"},{"$f":"Data!G2","v":"Student1"},{"$f":"IF(Teacher6Pretest!C8=\"\",\"\",Teacher6Pretest!E8)","v":""},null,{"$f":"IF(D8=\"\",\"\",$E$7)","v":""},{"$f":"IF(E8=\"\",\"\",D8/$E$7)","v":""},{"$f":"IF(D8>=P8,B8,\"\")","v":""},{"$f":"G8","v":""},{"$f":"IF(D8>=P9,IF(D8<P8,B8,\"\"),\"\")","v":""},{"$f":"I8","v":""},{"$f":"IF(D8>=P10,IF(D8<P9,B8,\"\"),\"\")","v":""},{"$f":"K8","v":""},{"$f":"IF(D8<P10,IF(D8=\"\",\"\",B8),\"\")","v":""},{"$f":"M8","v":""},null,{"$f":"Data!O11","v":5},"Proficient"]
[{"$f":"IF(ISBLANK(D9),\"FALSE\",IF(LEFT(B9,2)=\"**\",IF(D9>=$P$8,$P$8,IF(D9>=$P$9,$P$9,IF(D9>=$P$10,$P$10,$P$11)))))","v":"FALSE"},{"$f":"Data!G3","v":"Student2"},{"$f":"IF(Teacher6Pretest!C9=\"\",\"\",Teacher6Pretest!E9)","v":""},null,{"$f":"IF(D9=\"\",\"\",$E$7)","v":""},{"$f":"IF(E9=\"\",\"\",D9/$E$7)","v":""},{"$f":"IF(D9>=P8,B9,\"\")","v":""},{"$f":"H8&IF(G9=\"\",\"\",\", \")&G9","v":""},{"$f":"IF(D9>=P9,IF(D9<P8,B9,\"\"),\"\")","v":""},{"$f":"J8&IF(I9=\"\",\"\",\", \")&I9","v":""},{"$f":"IF(D9>=P10,IF(D9<P9,B9,\"\"),\"\")","v":""},{"$f":"L8&IF(K9=\"\",\"\",\", \")&K9","v":""},{"$f":"IF(D9<P10,IF(D9=\"\",\"\",B9),\"\")","v":""},{"$f":"N8&IF(M9=\"\",\"\",\", \")&M9","v":""},null,{"$f":"Data!O12","v":4},"Close to Proficient"]
["FALSE",{"$f":"Data!G4","v":"Student3"},{"$f":"IF(Teacher6Pretest!C10=\"\",\"\",Teacher6Pretest!E10)","v":""},null,"","",{"$f":"IF(D10>=P8,B10,\"\")","v":""},{"$f":"H9&IF(G10=\"\",\"\",\", \")&G10","v":""},{"$f":"IF(D10>=P9,IF(D10<P8,B10,\"\"),\"\")","v":""},{"$f":"J9&IF(I10=\"\",\"\",\", \")&I10","v":""},{"$f":"IF(D10>=P10,IF(D10<P9,B10,\"\"),\"\")","v":""},{"$f":"L9&IF(K10=\"\",\"\",\", \")&K10","v":""},{"$f":"IF(D10<P10,IF(D10=\"\",\"\",B10),\"\")","v":""},{"$f":"N9&IF(M10=\"\",\"\",\", \")&M10","v":""},null,{"$f":"Data!O13","v":3},"Far to Go But Likely to Become Proficient"]
["FALSE",{"$f":"Data!G5","v":"Student4"},{"$f":"IF(Teacher6Pretest!C11=\"\",\"\",Teacher6Pretest!E11)","v":""},null,"","",{"$f":"IF(D11>=P8,B11,\"\")","v":""},"",{"$f":"IF(D11>=P9,IF(D11<P8,B11,\"\"),\"\")","v":""},"",{"$f":"IF(D11>=P10,IF(D11<P9,B11,\"\"),\"\")","v":""},"",{"$f":"IF(D11<P10,IF(D11=\"\",\"\",B11),\"\")","v":""},"",null,{"$f":"Data!O14","v":1},"Intervention (Far to Go But Not Likely to Become Proficient)"]
["FALSE",{"$f":"Data!G6","v":"Student5"},{"$f":"IF(Teacher6Pretest!C12=\"\",\"\",Teacher6Pretest!E12)","v":""},null,"","",{"$f":"IF(D12>=P8,B12,\"\")","v":""},"",{"$f":"IF(D12>=P9,IF(D12<P8,B12,\"\"),\"\")","v":""},"",{"$f":"IF(D12>=P10,IF(D12<P9,B12,\"\"),\"\")","v":""},"",{"$f":"IF(D12<P10,IF(D12=\"\",\"\",B12),\"\")","v":""},""]
["FALSE",{"$f":"Data!G7","v":"Student6"},{"$f":"IF(Teacher6Pretest!C13=\"\",\"\",Teacher6Pretest!E13)","v":""},null,"","",{"$f":"IF(D13>=P8,B13,\"\")","v":""},"",{"$f":"IF(D13>=P9,IF(D13<P8,B13,\"\"),\"\")","v":""},"",{"$f":"IF(D13>=P10,IF(D13<P9,B13,\"\"),\"\")","v":""},"",{"$f":"IF(D13<P10,IF(D13=\"\",\"\",B13),\"\")","v":""},""]
["FALSE",{"$f":"Data!G8","v":"Student7"},{"$f":"IF(Teacher6Pretest!C14=\"\",\"\",Teacher6Pretest!E14)","v":""},null,"","",{"$f":"IF(D14>=P8,B14,\"\")","v":""},"",{"$f":"IF(D14>=P9,IF(D14<P8,B14,\"\"),\"\")","v":""},"",{"$f":"IF(D14>=P10,IF(D14<P9,B14,\"\"),\"\")","v":""},"",{"$f":"IF(D14<P10,IF(D14=\"\",\"\",B14),\"\")","v":""},""]
["FALSE",{"$f":"Data!G9","v":"Student8"},{"$f":"IF(Teacher6Pretest!C15=\"\",\"\",Teacher6Pretest!E15)","v":""},null,"","",{"$f":"IF(D15>=P8,B15,\"\")","v":""},"",{"$f":"IF(D15>=P9,IF(D15<P8,B15,\"\"),\"\")","v":""},"",{"$f":"IF(D15>=P10,IF(D15<P9,B15,\"\"),\"\")","v":""},"",{"$f":"IF(D15<P10,IF(D15=\"\",\"\",B15),\"\")","v":""},""]
["FALSE",{"$f":"Data!G10","v":"Student9"},{"$f":"IF(Teacher6Pretest!C16=\"\",\"\",Teacher6Pretest!E16)","v":""},null,"","",{"$f":"IF(D16>=P8,B16,\"\")","v":""},"",{"$f":"IF(D16>=P9,IF(D16<P8,B16,\"\"),\"\")","v":""},"",{"$f":"IF(D16>=P10,IF(D16<P9,B16,\"\"),\"\")","v":""},"",{"$f":"IF(D16<P10,IF(D16=\"\",\"\",B16),\"\")","v":""},""]
["FALSE",{"$f":"Data!G11","v":"Student10"},{"$f":"IF(Teacher6Pretest!C17=\"\",\"\",Teacher6Pretest!E17)","v":""},null,"","",{"$f":"IF(D17>=P8,B17,\"\")","v":""},"",{"$f":"IF(D17>=P9,IF(D17<P8,B17,\"\"),\"\")","v":""},"",{"$f":"IF(D17>=P10,IF(D17<P9,B17,\"\"),\"\")","v":""},"",{"$f":"IF(D17<P10,IF(D17=\"\",\"\",B17),\"\")","v":""},""]
["FALSE",{"$f":"Data!G12","v":"Student11"},{"$f":"IF(Teacher6Pretest!C18=\"\",\"\",Teacher6Pretest!E18)","v":""},null,"","",{"$f":"IF(D18>=P8,B18,\"\")","v":""},"",{"$f":"IF(D18>=P9,IF(D18<P8,B18,\"\"),\"\")","v":""},"",{"$f":"IF(D18>=P10,IF(D18<P9,B18,\"\"),\"\")","v":""},"",{"$f":"IF(D18<P10,IF(D18=\"\",\"\",B18),\"\")","v":""},""]
["FALSE",{"$f":"Data!G13","v":"Student12"},{"$f":"IF(Teacher6Pretest!C19=\"\",\"\",Teacher6Pretest!E19)","v":""},null,"","",{"$f":"IF(D19>=P8,B19,\"\")","v":""},"",{"$f":"IF(D19>=P9,IF(D19<P8,B19,\"\"),\"\")","v":""},"",{"$f":"IF(D19>=P10,IF(D19<P9,B19,\"\"),\"\")","v":""},"",{"$f":"IF(D19<P10,IF(D19=\"\",\"\",B19),\"\")","v":""},""]
["FALSE",{"$f":"Data!G14","v":"Student13"},{"$f":"IF(Teacher6Pretest!C20=\"\",\"\",Teacher6Pretest!E20)","v":""},null,"","",{"$f":"IF(D20>=P8,B20,\"\")","v":""},"",{"$f":"IF(D20>=P9,IF(D20<P8,B20,\"\"),\"\")","v":""},"",{"$f":"IF(D20>=P10,IF(D20<P9,B20,\"\"),\"\")","v":""},"",{"$f":"IF(D20<P10,IF(D20=\"\",\"\",B20),\"\")","v":""},""]
["FALSE",{"$f":"Data!G15","v":"Student14"},{"$f":"IF(Teacher6Pretest!C21=\"\",\"\",Teacher6Pretest!E21)","v":""},null,"","",{"$f":"IF(D21>=P8,B21,\"\")","v":""},"",{"$f":"IF(D21>=P9,IF(D21<P8,B21,\"\"),\"\")","v":""},"",{"$f":"IF(D21>=P10,IF(D21<P9,B21,\"\"),\"\")","v":""},"",{"$f":"IF(D21<P10,IF(D21=\"\",\"\",B21),\"\")","v":""},""]
["FALSE",{"$f":"Data!G16","v":"Student15"},{"$f":"IF(Teacher6Pretest!C22=\"\",\"\",Teacher6Pretest!E22)","v":""},null,"","",{"$f":"IF(D22>=P8,B22,\"\")","v":""},"",{"$f":"IF(D22>=P9,IF(D22<P8,B22,\"\"),\"\")","v":""},"",{"$f":"IF(D22>=P10,IF(D22<P9,B22,\"\"),\"\")","v":""},"",{"$f":"IF(D22<P10,IF(D22=\"\",\"\",B22),\"\")","v":""},""]
["FALSE",{"$f":"Data!G17","v":"Student16"},{"$f":"IF(Teacher6Pretest!C23=\"\",\"\",Teacher6Pretest!E23)","v":""},null,"","",{"$f":"IF(D23>=P8,B23,\"\")","v":""},"",{"$f":"IF(D23>=P9,IF(D23<P8,B23,\"\"),\"\")","v":""},"",{"$f":"IF(D23>=P10,IF(D23<P9,B23,\"\"),\"\")","v":""},"",{"$f":"IF(D23<P10,IF(D23=\"\",\"\",B23),\"\")","v":""},""]
["FALSE",{"$f":"Data!G18","v":"Student17"},{"$f":"IF(Teacher6Pretest!C24=\"\",\"\",Teacher6Pretest!E24)","v":""},null,"","",{"$f":"IF(D24>=P8,B24,\"\")","v":""},"",{"$f":"IF(D24>=P9,IF(D24<P8,B24,\"\"),\"\")","v":""},"",{"$f":"IF(D24>=P10,IF(D24<P9,B24,\"\"),\"\")","v":""},"",{"$f":"IF(D24<P10,IF(D24=\"\",\"\",B24),\"\")","v":""},""]
["FALSE",{"$f":"Data!G19","v":"Student18"},{"$f":"IF(Teacher6Pretest!C25=\"\",\"\",Teacher6Pretest!E25)","v":""},null,"","",{"$f":"IF(D25>=P8,B25,\"\")","v":""},"",{"$f":"IF(D25>=P9,IF(D25<P8,B25,\"\"),\"\")","v":""},"",{"$f":"IF(D25>=P10,IF(D25<P9,B25,\"\"),\"\")","v":""},"",{"$f":"IF(D25<P10,IF(D25=\"\",\"\",B25),\"\")","v":""},""]
["FALSE",{"$f":"Data!G20","v":"Student19"},{"$f":"IF(Teacher6Pretest!C26=\"\",\"\",Teacher6Pretest!E26)","v":""},null,"","",{"$f":"IF(D26>=P8,B26,\"\")","v":""},"",{"$f":"IF(D26>=P9,IF(D26<P8,B26,\"\"),\"\")","v":""},"",{"$f":"IF(D26>=P10,IF(D26<P9,B26,\"\"),\"\")","v":""},"",{"$f":"IF(D26<P10,IF(D26=\"\",\"\",B26),\"\")","v":""},""]
["FALSE",{"$f":"Data!G21","v":"Student20"},{"$f":"IF(Teacher6Pretest!C27=\"\",\"\",Teacher6Pretest!E27)","v":""},null,"","",{"$f":"IF(D27>=P8,B27,\"\")","v":""},"",{"$f":"IF(D27>=P9,IF(D27<P8,B27,\"\"),\"\")","v":""},"",{"$f":"IF(D27>=P10,IF(D27<P9,B27,\"\"),\"\")","v":""},"",{"$f":"IF(D27<P10,IF(D27=\"\",\"\",B27),\"\")","v":""},""]
["FALSE",{"$f":"Data!G22","v":"Student21"},{"$f":"IF(Teacher6Pretest!C28=\"\",\"\",Teacher6Pretest!E28)","v":""},null,"","",{"$f":"IF(D28>=P8,B28,\"\")","v":""},"",{"$f":"IF(D28>=P9,IF(D28<P8,B28,\"\"),\"\")","v":""},"",{"$f":"IF(D28>=P10,IF(D28<P9,B28,\"\"),\"\")","v":""},"",{"$f":"IF(D28<P10,IF(D28=\"\",\"\",B28),\"\")","v":""},""]
["FALSE",{"$f":"Data!G23","v":"Student22"},{"$f":"IF(Teacher6Pretest!C29=\"\",\"\",Teacher6Pretest!E29)","v":""},null,"","",{"$f":"IF(D29>=P8,B29,\"\")","v":""},"",{"$f":"IF(D29>=P9,IF(D29<P8,B29,\"\"),\"\")","v":""},"",{"$f":"IF(D29>=P10,IF(D29<P9,B29,\"\"),\"\")","v":""},"",{"$f":"IF(D29<P10,IF(D29=\"\",\"\",B29),\"\")","v":""},""]
["FALSE",{"$f":"Data!G24","v":"Student23"},{"$f":"IF(Teacher6Pretest!C30=\"\",\"\",Teacher6Pretest!E30)","v":""},null,"","",{"$f":"IF(D30>=P8,B30,\"\")","v":""},"",{"$f":"IF(D30>=P9,IF(D30<P8,B30,\"\"),\"\")","v":""},"",{"$f":"IF(D30>=P10,IF(D30<P9,B30,\"\"),\"\")","v":""},"",{"$f":"IF(D30<P10,IF(D30=\"\",\"\",B30),\"\")","v":""},""]
["FALSE",{"$f":"Data!G25","v":"Student24"},{"$f":"IF(Teacher6Pretest!C31=\"\",\"\",Teacher6Pretest!E31)","v":""},null,"","",{"$f":"IF(D31>=P8,B31,\"\")","v":""},"",{"$f":"IF(D31>=P9,IF(D31<P8,B31,\"\"),\"\")","v":""},"",{"$f":"IF(D31>=P10,IF(D31<P9,B31,\"\"),\"\")","v":""},"",{"$f":"IF(D31<P10,IF(D31=\"\",\"\",B31),\"\")","v":""},""]
["FALSE",{"$f":"Data!G26","v":"Student25"},{"$f":"IF(Teacher6Pretest!C32=\"\",\"\",Teacher6Pretest!E32)","v":""},null,"","",{"$f":"IF(D32>=P8,B32,\"\")","v":""},"",{"$f":"IF(D32>=P9,IF(D32<P8,B32,\"\"),\"\")","v":""},"",{"$f":"IF(D32>=P10,IF(D32<P9,B32,\"\"),\"\")","v":""},"",{"$f":"IF(D32<P10,IF(D32=\"\",\"\",B32),\"\")","v":""},""]
["FALSE",{"$f":"Data!G27","v":"Student26"},{"$f":"IF(Teacher6Pretest!C33=\"\",\"\",Teacher6Pretest!E33)","v":""},null,"","",{"$f":"IF(D33>=P8,B33,\"\")","v":""},"",{"$f":"IF(D33>=P9,IF(D33<P8,B33,\"\"),\"\")","v":""},"",{"$f":"IF(D33>=P10,IF(D33<P9,B33,\"\"),\"\")","v":""},"",{"$f":"IF(D33<P10,IF(D33=\"\",\"\",B33),\"\")","v":""},""]
["FALSE",{"$f":"Data!G28","v":"Student27"},{"$f":"IF(Teacher6Pretest!C34=\"\",\"\",Teacher6Pretest!E34)","v":""},null,"","",{"$f":"IF(D34>=P8,B34,\"\")","v":""},"",{"$f":"IF(D34>=P9,IF(D34<P8,B34,\"\"),\"\")","v":""},"",{"$f":"IF(D34>=P10,IF(D34<P9,B34,\"\"),\"\")","v":""},"",{"$f":"IF(D34<P10,IF(D34=\"\",\"\",B34),\"\")","v":""},""]
["FALSE",{"$f":"Data!G29","v":"Student28"},{"$f":"IF(Teacher6Pretest!C35=\"\",\"\",Teacher6Pretest!E35)","v":""},null,"","",{"$f":"IF(D35>=P8,B35,\"\")","v":""},"",{"$f":"IF(D35>=P9,IF(D35<P8,B35,\"\"),\"\")","v":""},"",{"$f":"IF(D35>=P10,IF(D35<P9,B35,\"\"),\"\")","v":""},"",{"$f":"IF(D35<P10,IF(D35=\"\",\"\",B35),\"\")","v":""},""]
["FALSE",{"$f":"Data!G30","v":"Student29"},{"$f":"IF(Teacher6Pretest!C36=\"\",\"\",Teacher6Pretest!E36)","v":""},null,"","",{"$f":"IF(D36>=P8,B36,\"\")","v":""},"",{"$f":"IF(D36>=P9,IF(D36<P8,B36,\"\"),\"\")","v":""},"",{"$f":"IF(D36>=P10,IF(D36<P9,B36,\"\"),\"\")","v":""},"",{"$f":"IF(D36<P10,IF(D36=\"\",\"\",B36),\"\")","v":""},""]
["FALSE",{"$f":"Data!G31","v":"Student30"},{"$f":"IF(Teacher6Pretest!C37=\"\",\"\",Teacher6Pretest!E37)","v":""},null,"","",{"$f":"IF(D37>=P8,B37,\"\")","v":""},"",{"$f":"IF(D37>=P9,IF(D37<P8,B37,\"\"),\"\")","v":""},"",{"$f":"IF(D37>=P10,IF(D37<P9,B37,\"\"),\"\")","v":""},"",{"$f":"IF(D37<P10,IF(D37=\"\",\"\",B37),\"\")","v":""},""]
["FALSE"]
[null,"TOTAL",null,{"$f":"SUM(D9:D37)","v":0},{"$f":"SUM(E8:E37)","v":0},{"$f":"D39/E39","v":{"$error":"#DIV/0!"}}]

{"sheet":"SummaryPost","index":21,"n_rows":12,"n_cols":18,"rows_kept":12,"cut":false,"hidden":false,"merged":[[8,0,8,17],[10,0,10,17],[0,2,7,2],[0,6,7,6],[0,10,7,10]]}
["Teacher","# Students",null,"# Proficient ","% Proficient","Proficient Students",null,"# Close to ","% Close to","Students Close to Proficiency",null,"# Far to Go ","% Far to Go ","Students Far to Go But Likely to Become Proficient",null,"# Intervention","% Intervention ","Intervention Students (Far to Go and Not Likely to Become Proficient)"]
[{"$f":"Data!A1","v":"March"},{"$f":"COUNT(Teacher1Post!D8:D37)","v":19},null,{"$f":"COUNTIF(Teacher1Post!D8:D37,\">=\"&Teacher1Post!P8)","v":11},{"$f":"D2/B2","v":0.57894736842105265},{"$f":"IF(Teacher1Post!P7=\"\",\"\",IF(Teacher1Post!P8=\"\",\"\",IF(LEFT(Teacher1Post!H37,1)=\",\",RIGHT(Teacher1Post!H37,LEN(Teacher1Post!H37)-1),Teacher1Post!H37)))","v":"Judy Blome, Betsy Byars, Jean Fritz, Patricia MacLachlan, **Barbara Park, Jack Prelutsky, Louis Sachar, Shel Silverstein, Seymour Simon, **Jerry Spinelli, Jane Yolen"},null,{"$f":"COUNTIF(Teacher1Post!D8:D37,\">=\"&Teacher1Post!P9)-COUNTIF(Teacher1Post!D8:D37,\">=\"&Teacher1Post!P8)","v":4},{"$f":"H2/B2","v":0.21052631578947367},{"$f":"IF(Teacher1Post!P7=\"\",\"\",IF(Teacher1Post!P8=\"\",\"\",IF(Teacher1Post!P9=\"\",\"\",IF(LEFT(Teacher1Post!J37,1)=\",\",RIGHT(Teacher1Post!J37, LEN(Teacher1Post!J37)-1),Teacher1Post!J37))))","v":" Pam Conrad, **Gary Paulsen, Cynthia Rylant, R.L. Stine"},null,{"$f":"COUNTIF(Teacher1Post!D8:D37,\">=\"&Teacher1Post!P10)-COUNTIF(Teacher1Post!D8:D37,\">=\"&Teacher1Post!P9)","v":2},{"$f":"L2/B2","v":0.10526315789473684},{"$f":"IF(Teacher1Post!P7=\"\",\"\",IF(Teacher1Post!P8=\"\",\"\",IF(Teacher1Post!P9=\"\",\"\",IF(Teacher1Post!P10=\"\",\"\",IF(LEFT(Teacher1Post!L37,1)=\",\",RIGHT(Teacher1Post!L37, LEN(Teacher1Post!L37)-1),Teacher1Post!L37)))))","v":" Lewis Carroll, Lois Lowry"},null,{"$f":"COUNTIF(Teacher1Post!D8:D37,\"<\"&Teacher1Post!P10)","v":2},{"$f":"P2/B2","v":0.10526315789473684},{"$f":"IF(LEFT(Teacher1Post!N37,1)=\",\",RIGHT(Teacher1Post!N37, LEN(Teacher1Post!N37)-1),Teacher1Post!N37)","v":" C.S. Lewis, J.K. Rowling"}]
[{"$f":"Data!B1","v":"Jones"},{"$f":"COUNT(Teacher2Post!D8:D37)","v":21},null,{"$f":"COUNTIF(Teacher2Post!D8:D37,\">=\"&Teacher2Post!P8)","v":11},0.52380952380952384,{"$f":"IF(Teacher1Post!P7=\"\",\"\",IF(Teacher1Post!P8=\"\",\"\",IF(LEFT(Teacher2Post!H37,1)=\",\",RIGHT(Teacher2Post!H37,LEN(Teacher2Post!H37)-1),Teacher2Post!H37)))","v":"**Justin Bieber, Taylor Swift, Beyonce Knowles, Madonna, **Kelly Clarkson, Aretha Franklin, Lady Gaga, Bruno Mars, Dolly Parton, Tony Bennett, Pat Benatar"},null,{"$f":"COUNTIF(Teacher2Post!D8:D37,\">=\"&Teacher2Post!P9)-COUNTIF(Teacher2Post!D8:D37,\">=\"&Teacher2Post!P8)","v":3},0.14285714285714285,{"$f":"IF(Teacher1Post!P7=\"\",\"\",IF(Teacher1Post!P8=\"\",\"\",IF(Teacher1Post!P8=\"\",\"\",IF(LEFT(Teacher2Post!J37,1)=\",\",RIGHT(Teacher2Post!J37, LEN(Teacher2Post!J37)-1),Teacher2Post!J37))))","v":" Billy Joel, **Axl Rose, Paul McCartney"},null,{"$f":"COUNTIF(Teacher2Post!D8:D37,\">=\"&Teacher2Post!P10)-COUNTIF(Teacher2Post!D8:D37,\">=\"&Teacher2Post!P9)","v":5},0.23809523809523808,{"$f":"IF(Teacher1Post!P7=\"\",\"\",IF(Teacher1Post!P8=\"\",\"\",IF(Teacher1Post!P9=\"\",\"\",IF(Teacher1Post!P10=\"\",\"\",IF(LEFT(Teacher2Post!L37,1)=\",\",RIGHT(Teacher2Post!L37, LEN(Teacher2Post!L37)-1),Teacher2Post!L37)))))","v":" Bon Jovi, Tim McGraw, **Bob Dylan, Eric Clapton, **Mick Jagger"},null,{"$f":"COUNTIF(Teacher2Post!D8:D37,\"<\"&Teacher2Post!P10)","v":2},9.5238095238095233E-2,{"$f":"IF(LEFT(Teacher2Post!N37,1)=\",\",RIGHT(Teacher2Post!N37, LEN(Teacher2Post!N37)-1),Teacher2Post!N37)","v":" Justin Timberlake, Elton John"}]
[{"$f":"Data!C1","v":"Gibson"},{"$f":"COUNT(Teacher3Post!D8:D37)","v":20},null,{"$f":"COUNTIF(Teacher3Post!D8:D37,\">=\"&Teacher3Post!P8)","v":12},0.6,{"$f":"IF(Teacher1Post!P7=\"\",\"\",IF(Teacher1Post!P8=\"\",\"\",IF(LEFT(Teacher3Post!H37,1)=\",\",RIGHT(Teacher3Post!H37,LEN(Teacher3Post!H37)-1),Teacher3Post!H37)))","v":"**Albert Einstein, Carl Sagan*, Henry Ford, Ivan Pavlov, **Jonas Salk, **Marie Curie, Sigmund Freud, Stephen Hawking, Thomas Edison, Howard Gardner, Lev Vygotsky, Maria Montessori"},null,{"$f":"COUNTIF(Teacher3Post!D8:D37,\">=\"&Teacher3Post!P9)-COUNTIF(Teacher3Post!D8:D37,\">=\"&Teacher3Post!P8)","v":4},0.2,{"$f":"IF(Teacher1Post!P7=\"\",\"\",IF(Teacher1Post!P8=\"\",\"\",IF(Teacher1Post!P9=\"\",\"\",IF(LEFT(Teacher3Post!J37,1)=\",\",RIGHT(Teacher3Post!J37, LEN(Teacher3Post!J37)-1),Teacher3Post!J37))))","v":" Alfred Nobel, Charles Darwin, John Dewey, **B.F. Skinner"},null,{"$f":"COUNTIF(Teacher3Post!D8:D37,\">=\"&Teacher3Post!P10)-COUNTIF(Teacher3Post!D8:D37,\">=\"&Teacher3Post!P9)","v":2},0.1,{"$f":"IF(Teacher1Post!P7=\"\",\"\",IF(Teacher1Post!P8=\"\",\"\",IF(Teacher1Post!P9=\"\",\"\",IF(Teacher1Post!P10=\"\",\"\",IF(LEFT(Teacher3Post!L37,1)=\",\",RIGHT(Teacher3Post!L37, LEN(Teacher3Post!L37)-1),Teacher3Post!L37)))))","v":" Benjamin Franklin, Jane Goodall"},null,{"$f":"COUNTIF(Teacher3Post!D8:D37,\"<\"&Teacher3Post!P10)","v":2},0.1,{"$f":"IF(LEFT(Teacher3Post!N37,1)=\",\",RIGHT(Teacher3Post!N37, LEN(Teacher3Post!N37)-1),Teacher3Post!N37)","v":" **Isaac Newton, Jean Piaget"}]
[{"$f":"Data!D1","v":"Smith"},{"$f":"COUNT(Teacher4Post!D8:D37)","v":19},null,{"$f":"COUNTIF(Teacher4Post!D8:D37,\">=\"&Teacher4Post!P8)","v":10},0.52631578947368418,{"$f":"IF(Teacher1Post!P7=\"\",\"\",IF(Teacher1Post!P8=\"\",\"\",IF(LEFT(Teacher4Post!H37,1)=\",\",RIGHT(Teacher4Post!H37,LEN(Teacher4Post!H37)-1),Teacher4Post!H37)))","v":"Michael Jordan, Muhammad Ali, Serena Williams, **Joe Montana, Shaun White, Danica Patrick, **Tony Hawk, LeBron James, **George Forman, Martina Navratilova"},null,{"$f":"COUNTIF(Teacher4Post!D8:D37,\">=\"&Teacher4Post!P9)-COUNTIF(Teacher4Post!D8:D37,\">=\"&Teacher4Post!P8)","v":6},0.31578947368421051,{"$f":"IF(Teacher1Post!P7=\"\",\"\",IF(Teacher1Post!P8=\"\",\"\",IF(Teacher1Post!P9=\"\",\"\",IF(LEFT(Teacher4Post!J37,1)=\",\",RIGHT(Teacher4Post!J37, LEN(Teacher4Post!J37)-1),Teacher4Post!J37))))","v":" Roger Federer, Wayne Gretzky, **Jim Thorpe, Jeff Gordon, Peyton Manning, Yadier Molina"},null,{"$f":"COUNTIF(Teacher4Post!D8:D37,\">=\"&Teacher4Post!P10)-COUNTIF(Teacher4Post!D8:D37,\">=\"&Teacher4Post!P9)","v":0},0,{"$f":"IF(Teacher1Post!P7=\"\",\"\",IF(Teacher1Post!P8=\"\",\"\",IF(Teacher1Post!P9=\"\",\"\",IF(Teacher1Post!P10=\"\",\"\",IF(LEFT(Teacher4Post!L37,1)=\",\",RIGHT(Teacher4Post!L37, LEN(Teacher4Post!L37)-1),Teacher4Post!L37)))))","v":""},null,{"$f":"COUNTIF(Teacher4Post!D8:D37,\"<\"&Teacher4Post!P10)","v":3},0.15789473684210525,{"$f":"IF(LEFT(Teacher4Post!N37,1)=\",\",RIGHT(Teacher4Post!N37, LEN(Teacher4Post!N37)-1),Teacher4Post!N37)","v":" **Michael Phelps, Tiger Woods, Gordie Howe"}]
[{"$f":"Data!E1","v":"Do Not Use"},{"$f":"COUNT('Do Not Use'!B8:B37)","v":0},null,{"$f":"COUNTIF('Do Not Use'!B8:B37,\">=\"&'Do Not Use'!N8)","v":0},{"$error":"#DIV/0!"},{"$f":"IF(Teacher1Post!P7=\"\",\"\",IF(Teacher1Post!P8=\"\",\"\",IF(LEFT('Do Not Use'!F37,1)=\",\",RIGHT('Do Not Use'!F37,LEN('Do Not Use'!F37)-1),'Do Not Use'!F37)))","v":""},null,{"$f":"COUNTIF('Do Not Use'!B8:B37,\">=\"&'Do Not Use'!N9)-COUNTIF('Do Not Use'!B8:B37,\">=\"&'Do Not Use'!N8)","v":0},{"$error":"#DIV/0!"},{"$f":"IF(Teacher1Post!P7=\"\",\"\",IF(Teacher1Post!P8=\"\",\"\",IF(Teacher1Post!P9=\"\",\"\",IF(LEFT('Do Not Use'!H37,1)=\",\",RIGHT('Do Not Use'!H37, LEN('Do Not Use'!H37)-1),'Do Not Use'!H37))))","v":""},null,{"$f":"COUNTIF('Do Not Use'!B8:B37,\">=\"&'Do Not Use'!N10)-COUNTIF('Do Not Use'!B8:B37,\">=\"&'Do Not Use'!N9)","v":0},{"$error":"#DIV/0!"},{"$f":"IF(Teacher1Post!P7=\"\",\"\",IF(Teacher1Post!P8=\"\",\"\",IF(Teacher1Post!P9=\"\",\"\",IF(Teacher1Post!P10=\"\",\"\",IF(LEFT('Do Not Use'!J37,1)=\",\",RIGHT('Do Not Use'!J37, LEN('Do Not Use'!J37)-1),'Do Not Use'!J37)))))","v":""},null,{"$f":"COUNTIF('Do Not Use'!B8:B37,\"<\"&'Do Not Use'!N10)","v":0},{"$error":"#DIV/0!"},{"$f":"IF(LEFT('Do Not Use'!L37,1)=\",\",RIGHT('Do Not Use'!L37, LEN('Do Not Use'!L37)-1),'Do Not Use'!L37)","v":""}]
[{"$f":"Data!F1","v":"Milburn"},{"$f":"COUNT(Teacher5Post!D8:D37)","v":16},null,{"$f":"COUNTIF(Teacher5Post!D8:D37,\">=\"&Teacher5Post!P8)","v":11},0.6875,{"$f":"IF(Teacher1Post!P7=\"\",\"\",IF(Teacher1Post!P8=\"\",\"\",IF(LEFT(Teacher5Post!H37,1)=\",\",RIGHT(Teacher5Post!H37,LEN(Teacher5Post!H37)-1),Teacher5Post!H37)))","v":"Dave Sanders, Carolyn Neal, Bertha Richardson, Chris Montgomery, Darlene Jones, Dexter Schraer, Janice Putman, Julie Sperry, Rose Coleman, **Sam McCauley, Tricia Buchanan"},null,{"$f":"COUNTIF(Teacher5Post!D8:D37,\">=\"&Teacher5Post!P9)-COUNTIF(Teacher5Post!D8:D37,\">=\"&Teacher5Post!P8)","v":3},0.1875,{"$f":"IF(Teacher1Post!P7=\"\",\"\",IF(Teacher1Post!P8=\"\",\"\",IF(Teacher1Post!P9=\"\",\"\",IF(LEFT(Teacher5Post!J37,1)=\",\",RIGHT(Teacher5Post!J37, LEN(Teacher5Post!J37)-1),Teacher5Post!J37))))","v":" Don Rugraff, Jeanne Rothermel, **Beth Tobin"},null,{"$f":"COUNTIF(Teacher5Post!D8:D37,\">=\"&Teacher5Post!P10)-COUNTIF(Teacher5Post!D8:D37,\">=\"&Teacher5Post!P9)","v":1},6.25E-2,{"$f":"IF(Teacher1Post!P7=\"\",\"\",IF(Teacher1Post!P8=\"\",\"\",IF(Teacher1Post!P9=\"\",\"\",IF(Teacher1Post!P10=\"\",\"\",IF(LEFT(Teacher5Post!L37,1)=\",\",RIGHT(Teacher5Post!L37, LEN(Teacher5Post!L37)-1),Teacher5Post!L37)))))","v":" Randy Speer"},null,{"$f":"COUNTIF(Teacher5Post!D8:D37,\"<\"&Teacher5Post!P10)","v":1},6.25E-2,{"$f":"IF(LEFT(Teacher5Post!N37,1)=\",\",RIGHT(Teacher5Post!N37, LEN(Teacher5Post!N37)-1),Teacher5Post!N37)","v":" Bill Scheffler"}]
[{"$f":"Data!G1","v":"Teacher6"},{"$f":"COUNT(Teacher6Post!D8:D37)","v":0},null,{"$f":"COUNTIF(Teacher6Post!D8:D37,\">=\"&Teacher6Post!P8)","v":0},{"$error":"#DIV/0!"},{"$f":"IF(Teacher1Post!P7=\"\",\"\",IF(Teacher1Post!P8=\"\",\"\",IF(LEFT(Teacher6Post!H37,1)=\",\",RIGHT(Teacher6Post!H37,LEN(Teacher6Post!H37)-1),Teacher6Post!H37)))","v":""},null,{"$f":"COUNTIF(Teacher6Post!D8:D37,\">=\"&Teacher6Post!P9)-COUNTIF(Teacher6Post!D8:D37,\">=\"&Teacher6Post!P8)","v":0},{"$error":"#DIV/0!"},{"$f":"IF(Teacher1Post!P7=\"\",\"\",IF(Teacher1Post!P8=\"\",\"\",IF(Teacher1Post!P9=\"\",\"\",IF(LEFT(Teacher6Post!J37,1)=\",\",RIGHT(Teacher6Post!J37, LEN(Teacher6Post!J37)-1),Teacher6Post!J37))))","v":""},null,{"$f":"COUNTIF(Teacher6Post!D8:D37,\">=\"&Teacher6Post!P10)-COUNTIF(Teacher6Post!D8:D37,\">=\"&Teacher6Post!P9)","v":0},{"$error":"#DIV/0!"},{"$f":"IF(Teacher1Post!P7=\"\",\"\",IF(Teacher1Post!P8=\"\",\"\",IF(Teacher1Post!P9=\"\",\"\",IF(Teacher1Post!P10=\"\",\"\",IF(LEFT(Teacher6Post!L37,1)=\",\",RIGHT(Teacher6Post!L37, LEN(Teacher6Post!L37)-1),Teacher6Post!L37)))))","v":""},null,{"$f":"COUNTIF(Teacher6Post!D8:D37,\"<\"&Teacher6Post!P10)","v":0},{"$error":"#DIV/0!"},{"$f":"IF(LEFT(Teacher6Post!N37,1)=\",\",RIGHT(Teacher6Post!N37, LEN(Teacher6Post!N37)-1),Teacher6Post!N37)","v":""}]
[]
["TOTAL",{"$f":"SUM(B2:B8)","v":95},null,{"$f":"SUM(D2:D8)","v":55},{"$f":"D10/B10","v":0.57894736842105265},null,null,{"$f":"SUM(H2:H8)","v":20},{"$f":"H10/B10","v":0.21052631578947367},null,null,{"$f":"SUM(L2:L8)","v":10},{"$f":"L10/B10","v":0.10526315789473684},null,null,{"$f":"SUM(P2:P8)","v":10},{"$f":"P10/B10","v":0.10526315789473684}]
[]
[{"$f":"IF(Data!N15=\"YES\",\"SMART Goal\",\"\")","v":"SMART Goal"},null,{"$f":"IF(Data!N15=\"YES\",(D10+H10+L10)/B10,\"\")","v":0.89473684210526316}]